{"text_format":"1","workbook":"xlsx","n_sheets":8,"sheets":["Mode d'emploi","données d'entrée","Scénario 1","Scénario 2","Scénario 3","Synthèse","Synthèse pour trame","Déficit de financement"],"not_rendered":{"charts":24,"images":3,"macros":1,"external_links":0,"defined_names":65,"comments":8,"pivot_tables":0},"unopened":[],"bounds":{"document_bytes":16777216,"sheet_cells":100000,"rows_first":2000,"rows_last":500,"rows_between":2000,"halvings":0,"cell_chars":16384,"cell_head_chars":4096},"cells_cut":0,"cells_raw":0,"read":"whole","date_system":"1900"}

{"sheet":"Mode d'emploi","index":0,"n_rows":14,"n_cols":5,"rows_kept":14,"cut":false,"hidden":false,"merged":[[1,1,1,7],[13,2,14,6],[10,2,10,6],[12,2,12,6]]}
[]
[null,"Utilisation du document"]
[]
[null,"Dans toutes les feuilles excel :",null,null,"Légende"]
[null,null,null,null,"Autoremplissage"]
[null,null,null,null,"Autoremplissage"]
[null,null,null,null,"A remplir"]
[]
[null,"Détails des feuilles"]
[null,"Données d'entrées","Permet de renseigner les données d'entrée de votre projet (bâtiments, consommation, coût du MWh en fonction de l'énergie, inflation, etc…)"]
[null,"Scénario 1 à 3","Permettent de réaliser des scénarii pour le projet. Il est important de suivre l'ordre indiqué dans la feuille. \nUn couplage solaire thermique et géothermie peut être ajouté, si ce n'est pas votre cas, laisser les listes déroulante dédiées sur \"Non\". Si vous avez un couplage, cochez Oui, remplissez les données d'entrées et les calculs seront automatiquement réalisés.\nLes MWh éligibles sont maintenant plafonnés, le calcul est géré automatiquement.\nLes aides CEE sont cumulables avec les aides ADEME (fond chaleur) dans une limite de 65% de l'investissement éligible. Un coup de pouce peut être attribué en fonction du projet. Toutes ces étapes sont calculées automatiquement.\nSi une baisse des besoins est à appliquer et uniquement dans ce cas précis, merci de modifier la cellule W78 dans la feuille \"Synthèse pour trame\" en sélectionnant la valeur \"Oui\" et indiquer en W79 la baisse appliquée (valeur positive). Dans ce cas précis l'analyse de sensibilité n'est pas utilisable. De même, si vous souhaitez appliquer une baisse des besoins différente pour chaque bâtiment, l'analyse de sensibilité ne fonctionnera plus.\nSi vous souhaitez modifier le titre d'un scénario, il faut modifier le nom de la feuille, le reste sera géré automatiquement."]
[null,"Synthèse","Si votre projet ne concerne pas une installation agricole, ne pas l'utiliser."]
[null,"Synthèse pour trame","Cette feuille récapitule l'ensemble des données qu'il est nécessaire d'exporter pour le rapport de l'étude d'opportunité. Vous trouverez une colonne par scénario, dans le cas contraire, la donnée est commune.\nUne partie \"Analyse de sensibilité\" est ajoutée. Elle permet de vérifier la robustesse d'un projet en faisant varier différentes données.  Pour l'utiliser, choisissez le scénario concerné et cliquer sur le bouton \"Actualiser\". Les coûts de la chaleur sont comparés entre la solution de référence et la solution de votre scénario (bois et/ou couplage). Les cellules apparaissent en vert si le scénario est plus intéressant que la référence.\nATTENTION! Pour utiliser cette fonctionnalité, il est obligatoire d'avoir activé l'utilisation de macro. Si la macro n'est pas utilisable, vérifier que le fichier est débloqué (clic droit sur le fichier --> propriétés --> débloquer --> Appliquer)."]
[null,"Déficit de financement","A utiliser seulement si votre projet concerne un réseau de chaleur avec vente > 2 sous stations.\nIl permet de calculer une donnée économique à partir de votre projet. Pour cela modifier le scénario affecté en cellule B2 de cette feuille. Ensuite, les calculs sont automatiquement réalisés, il ne manque plus qu'à récupérer la valeur en A48 et à la coller en valeur brute en cellule S119 du scénario concerné. L'aide sera alors plafonnée via le maximum entre le déficit de financement et l'aide plafonnée usuellement."]

{"sheet":"données d'entrée","index":1,"n_rows":37,"n_cols":34,"rows_kept":37,"cut":false,"hidden":false,"merged":[[0,31,1,31],[0,32,0,33],[0,24,1,24],[0,25,1,25],[0,26,0,27],[2,3,2,4],[36,3,36,11],[0,30,1,30],[7,1,7,13],[8,1,8,13]]}
[null,null,null,null,"installation d'une chaufferie bois  - [nom du projet] à [lieu du projet]",null,null,null,null,null,null,null,null,null,null,null,null,null,null,null,null,null,null,null,"Type de bâtiment","Catégorisation pour fiche CEE","Fiche CEE BAT TH 127< 400 kW",null,null,null,"Type de bâtiment","Catégorisation pour fiche CEE","Fiche CEE BAT TH 127 > 400 kW"]
[null,null,null,"Version 13 02/06/2026",null,null,null,null,null,null,null,null,null,null,null,null,null,null,null,null,null,null,null,null,null,null,"Coefficient chauffage","Coefficient chauffage + ECS",null,null,null,null,"Coefficient chauffage","Coefficient chauffage + ECS"]
[null,null,null,"1/ PORTEUR DE PROJET",null,null,null,null,null,null,null,null,null,null,null,"2/ PRIX DES COMBUSTIBLES (€ HT/MWH)",{"$f":"IF(E5=\"\",2026,E5)","v":2026},null,null,null,null,null,null,null,"Logements collectifs /Résidences étudiantes",null,null,null,null,null,"Logements collectifs /Résidences étudiantes"]
[null,null,null,"qui est le maitre d'ouvrage du projet ?",null,null,null,null,null,null,null,null,null,null,null,"bois déchiqueté",35,null,null,null,null,null,null,null," EHPAD","Santé",400,540,null,null," EHPAD","Santé",310,410]
[null,null,null,"Année de démarrage du projet ?",null,null,null,null,null,null,null,null,null,null,null,"électricité",200,null,null,null,null,null,null,null,"Maisons individuelles",null,null,null,null,null,"Maisons indivduelles"]
[null,null,null,null,null,null,null,null,null,null,null,null,null,null,null,"fioul",110,null,null,null,null,null,null,null,"Bureaux","Bureaux",480,510,null,null,"Bureaux","Bureaux",370,390]
[null,null,null,null,null,null,null,null,null,null,null,null,null,null,null,"gaz naturel",100,null,null,null,null,null,null,null," Lycées avec internat","Enseignement",310,360,null,null," Lycées avec internat","Enseignement",240,270]
[null,"3/ SITUATION ACTUELLE",null,null,null,null,null,null,null,null,null,null,null,null,null,"granulé",77,null,null,null,null,null,null,null,"Crèches/ Écoles/ Collèges/ Lycée sans internat","Enseignement",310,360,null,null,"Crèches/ Écoles/ Collèges/ Lycée sans internat","Enseignement",240,270]
[null,"Caractéristiques de l'installation",null,null,null,null,null,null,null,null,null,null,null,null,null,"propane",117,null,null,null,null,null,null,null,"Café / hôtels / restaurants","Hôtellerie/restauration",540,680,null,null,"Café / hôtels / restaurants","Hôtellerie/restauration",410,520]
[null,"Type de bâtiment","Nombre de logements si résidentiel collectif ou individuel","bâtiment(s)","surface à chauffer (m2)","énergie actuelle utilisée","puissance installée (kW)","consommation moyenne sur 3 ans\n( chauffage + ECS ; MWh PCI)","Dont consommation d'ECS (si non connue, 0)","rendement de production de l'installation actuelle","besoin utile ( chauffage + ECS ; MWh PCI)","Ratio de consommation énergétique de chauffage seul en kWh/m²","année installation","vétusté  actuelle",null,null,null,null,null,null,null,null,null,null,"Hopitaux / cliniques","Santé",400,540,null,null,"Hopitaux / cliniques","Santé",310,410]
[null,null,null,null,null,null,null,null,null,null,{"$f":"(H11)*J11","v":0},{"$f":"IF(E11=0,\"\",IF(H11=0,\"\",(H11-I11)*1000/E11))","v":""},null,{"$f":"IF(ISBLANK(D11)=TRUE,0,MIN(IF(OR(M11=\"\",M11=$E$5),1,($Q$3-M11)/20),100%))","v":0},null,null,null,null,null,null,null,null,null,null,"Commerces","Commerces",370,420,null,null,"Commerces","Commerces",280,320]
[null,null,null,null,null,null,null,null,null,null,{"$f":"(H12)*J12","v":0},{"$f":"IF(E12=0,\"\",IF(H12=0,\"\",(H12-I12)*1000/E12))","v":""},null,{"$f":"IF(ISBLANK(D12)=TRUE,0,MIN(IF(OR(M12=\"\",M12=$E$5),1,($Q$3-M12)/20),100%))","v":0},null,null,null,null,null,null,null,null,null,null,"Sports, culture, Loisirs et Equipements sportifs (SCLE)","Autres",310,330,null,null,"Sports, culture, Loisirs et Equipements sportifs (SCLE)","Autres",240,260]
[null,null,null,null,null,null,null,null,null,null,0,"",null,0,null,null,null,null,null,null,null,null,null,null,"Piscine","Autres",310,330,null,null,"Piscine","Autres",240,260]
[null,null,null,null,null,null,null,null,null,null,0,"",null,0,null,null,null,null,null,null,null,null,null,null,"Bâtiments tertiaires mixtes","Autres",310,330,null,null,"Bâtiments tertiaires mixtes","Autres",240,260]
[null,null,null,null,null,null,null,null,null,null,0,"",null,0]
[null,null,null,null,null,null,null,null,null,null,0,"",null,0]
[null,null,null,null,null,null,null,null,null,null,0,"",null,0]
[null,null,null,null,null,null,null,null,null,null,0,"",null,0]
[null,null,null,null,null,null,null,null,null,null,0,"",null,0]
[null,null,null,null,null,null,null,null,null,null,0,"",null,0]
[null,null,null,null,null,null,null,null,null,null,0,"",null,0]
[null,null,null,null,null,null,null,null,null,null,0,"",null,0]
[null,null,null,null,null,null,null,null,null,null,0,"",null,0]
[null,null,null,null,null,null,null,null,null,null,0,"",null,0]
[null,null,null,null,null,null,null,null,null,null,0,"",null,0]
[null,null,null,null,null,null,null,null,null,null,0,"",null,0]
[null,null,null,null,null,null,null,null,null,null,0,"",null,0]
[null,null,null,null,null,null,null,null,null,null,0,"",null,0,null,"4/ ANALYSE DE SENSIBILITE"]
[null,null,null,null,null,null,null,null,null,null,0,"",null,0]
[null,null,null,null,null,null,null,null,null,null,0,"",null,0,null,"Prix MWh cumac",7.5]
[null,null,null,null,null,null,null,null,null,null,0,"",null,0,null,"Inflation maintenance :",0.02]
[null,null,null,null,null,null,null,null,null,null,0,"",null,0,null,"Inflation énergie bois :",0.01]
[null,null,null,null,null,null,null,null,null,null,0,"",null,0,null,"Inflation énergie électrique :",0.04]
[null,null,null,null,null,null,null,null,null,null,0,"",null,0,null,"Inflation énergie fossile :",0.03]
[null,null,null,null,null,null,null,null,null,null,0,"",null,0]
[]
[null,null,null,"Consignes pour rajouter des sites supplémentaires / intégrer de nouveaux bâtiments par scénario : \n\n- Sélectionner la feuille du scénario (1,2 ou 3) oiu vous souhaitez voir apparaître le nouveau bâtiment\n\n- appuyer sur le bouton \"ajout d'un bâtiment\" situé à droite du tableau \"situation actuelle\" sur la feuille du scénario désiré"]

{"sheet":"Scénario 1","index":2,"n_rows":216,"n_cols":91,"rows_kept":216,"cut":false,"hidden":false,"merged":[[206,17,206,18],[206,19,206,20],[204,16,205,20],[177,16,177,34],[122,16,122,34],[66,16,66,20],[70,24,70,25],[71,24,71,25],[97,22,97,26],[98,16,98,20],[2,1,2,13],[2,16,2,28],[5,24,5,25],[34,16,34,25],[5,16,5,17],[6,19,6,21],[7,19,7,21],[8,19,8,21],[5,19,5,22],[5,1,5,14],[6,1,6,14],[0,16,0,28],[0,1,0,14],[1,5,1,6],[1,2,1,4],[1,7,1,13],[65,16,65,27],[123,8,123,14],[86,23,86,24],[167,7,167,13],[193,7,194,7],[193,10,193,11],[95,1,95,13],[96,8,96,13],[96,1,96,5],[165,3,165,4],[108,3,108,4],[109,3,109,4],[98,3,98,4],[122,1,122,14],[66,22,66,27],[145,16,145,33],[36,1,36,9],[35,1,35,9],[67,1,67,4],[193,8,194,8],[193,9,194,9],[66,1,66,14],[193,1,194,1],[193,2,194,2],[193,3,194,3],[193,4,193,5],[111,1,111,13]]}
[null,{"$f":"'données d''entrée'!E1","v":"installation d'une chaufferie bois  - [nom du projet] à [lieu du projet]"},null,null,null,null,null,null,null,null,null,null,null,null,null,null,{"$f":"B1","v":"installation d'une chaufferie bois  - [nom du projet] à [lieu du projet]"}]
[null,"Titre scénario :",{"$f":"TRIM(RIGHT(SUBSTITUTE(CELL(\"nomfichier\",B1),\"]\",REPT(\" \",100)),100))","v":"Scénario 1"},null,null,"Détail scénario: "]
[null,"PARTIE TECHNIQUE",null,null,null,null,null,null,null,null,null,null,null,null,null,null,"PARTIE ECONOMIQUE"]
[null,{"$f":"'données d''entrée'!D2","v":"Version 13 02/06/2026"}]
[]
[null,"1/ SITUATION ACTUELLE",null,null,null,null,null,null,null,null,null,null,null,null,null,null,"7/ PORTEUR DE PROJET",null,null,"8/ DEFINITION DU REGIME TVA",null,null,null,null,"9/ PRIX DES COMBUSTIBLES (€ HT/MWH)"]
[null,"Caractéristiques de l'installation",null,null,null,null,null,null,null,null,null,null,null,null,null,null,"qui est le maitre d'ouvrage du projet ?",{"$f":"IF('données d''entrée'!E4=0,\" \",'données d''entrée'!E4)","v":" "},null,"Y aura-t-il vente de chaleur à 2 abonnés minimum ?",null,null,"Oui",null,"bois déchiqueté",{"$f":"IF('données d''entrée'!Q4=0,\" \",IF('Synthèse pour trame'!$B$82='Scénario 1'!Y7,'données d''entrée'!Q4*(1+'Synthèse pour trame'!$W$86),'données d''entrée'!Q4))","v":35},null,null,null,null,null,null,null,null,null,null,null,null,null,null,null,null,null,null,null,null,null,null,null,null,null,null,null,null,null,null,null,null,null,null,null,null,null,null,null,null,null,null,null,null,null,null,null,null,null,null,null,null,null,null,null,null,null,null,null,null,null,null,null,null,"test"]
[null,"Type de bâtiment","Nombre de logements si résidentiel collectif ou individuel","Bâtiment(s)","surface à chauffer (m2)","énergie actuelle utilisée","puissance installée (kW)","consommation moyenne sur 3 ans\n( chauffage + ECS ; MWh PCI)","Consommation d'ECS (si non connue, 0)","Rendement de production de référence","besoin utile ( chauffage + ECS ; MWh PCI)","Ratio de consommation énergétique de chauffage seul en kWh/m²","Révision ratio pour plafonnement","année installation","vétusté  actuelle",null,"Année de démarrage du projet ?",{"$f":"IF('données d''entrée'!E5=0,\" \",'données d''entrée'!E5)","v":" "},null,"Le client récupère-t-il la TVA?",null,null,"Oui",null,"électricité",{"$f":"IF('données d''entrée'!Q5=0,\" \",IF('Synthèse pour trame'!$B$82='Scénario 1'!Y8,'données d''entrée'!Q5*(1+'Synthèse pour trame'!$W$86),'données d''entrée'!Q5))","v":200},null,null,null,null,null,null,null,null,null,null,null,null,null,null,null,null,null,null,null,null,null,null,null,null,null,null,null,null,null,null,null,null,null,null,null,null,null,null,null,null,null,null,null,null,null,null,null,null,null,null,null,null,null,null,null,null,null,null,null,null,null,null,null,null,{"$f":"IF(AE181>($U$95-$R$63),0,1)","v":1}]
[null,{"$f":"IF('données d''entrée'!B11=0,\" \",'données d''entrée'!B11)","v":" "},{"$f":"IF('données d''entrée'!C11=0,\" \",'données d''entrée'!C11)","v":" "},{"$f":"IF('données d''entrée'!D11=0,\" \",'données d''entrée'!D11)","v":" "},{"$f":"IF('données d''entrée'!E11=0,0,'données d''entrée'!E11)","v":0},{"$f":"IF('données d''entrée'!F11=0,\" \",'données d''entrée'!F11)","v":" "},{"$f":"IF('données d''entrée'!G11=0,\" \",'données d''entrée'!G11)","v":" "},{"$f":"IF('données d''entrée'!H11=0,\" \",'données d''entrée'!H11)","v":" "},{"$f":"IF('données d''entrée'!I11=0,0,'données d''entrée'!I11)","v":0},{"$f":"IF('données d''entrée'!J11=0,\" \",'données d''entrée'!J11)","v":" "},{"$f":"IF(OR(H9=\" \",J9=\" \"),\"\",(H9)*J9)","v":""},{"$f":"IF('données d''entrée'!L11=0,\" \",'données d''entrée'!L11)","v":""},{"$f":"IFERROR(_xlfn.IFS(\nAND(OR(B9=$B$197,B9=$B$199,B9=$B$200,B9=$B$201,B9=$B$202,B9=$B$203,B9=$B$204,B9=$B$205,B9=$B$207),L9>100),100,\nAND(OR(B9=$B$197,B9=$B$199,B9=$B$200,B9=$B$201,B9=$B$202,B9=$B$203,B9=$B$204,B9=$B$205,B9=$B$207),L9<=100),L9,\nAND(OR(B9=$B$196,B9=$B$198),L9>90),90,\nAND(OR(B9=$B$196,B9=$B$198),L9<=90),L9,\nOR(B9=\"\",B9=$B$206),L9),0)","v":0},{"$f":"IF('données d''entrée'!M11=0,\" \",'données d''entrée'!M11)","v":" "},{"$f":"IFERROR(IF(OR('données d''entrée'!N11<>0,AND('données d''entrée'!N11=0,N9-$R$8>=0)),'données d''entrée'!N11,\"\"),\"\")","v":""},{"$f":"IF(AND(E9<=7500,B9<>B196,B9<>B198,E9<>0),1,0)","v":0},{"$f":"IF(AND(C9<=125,OR(B9=C196,B9=C198)),1,0)","v":0},null,null,"Taux de TVA sur investissement si pas de récupération de TVA (/!\\ FCTVA 16,4%?) :",null,null,0.2,null,"fioul",{"$f":"IF('données d''entrée'!Q6=0,\" \",IF('Synthèse pour trame'!$B$82='Scénario 1'!Y9,'données d''entrée'!Q6*(1+'Synthèse pour trame'!$W$86),'données d''entrée'!Q6))","v":110},null,null,null,null,null,null,null,null,null,null,null,null,null,null,null,null,null,null,null,null,null,null,null,null,null,null,null,null,null,null,null,null,null,null,null,null,null,null,null,null,null,null,null,null,null,null,null,null,null,null,null,null,null,null,null,null,null,null,null,null,null,null,null,null,1]
[null,{"$f":"IF('données d''entrée'!B12=0,\" \",'données d''entrée'!B12)","v":" "},{"$f":"IF('données d''entrée'!C12=0,\" \",'données d''entrée'!C12)","v":" "},{"$f":"IF('données d''entrée'!D12=0,\" \",'données d''entrée'!D12)","v":" "},{"$f":"IF('données d''entrée'!E12=0,0,'données d''entrée'!E12)","v":0},{"$f":"IF('données d''entrée'!F12=0,\" \",'données d''entrée'!F12)","v":" "},{"$f":"IF('données d''entrée'!G12=0,\" \",'données d''entrée'!G12)","v":" "},{"$f":"IF('données d''entrée'!H12=0,\" \",'données d''entrée'!H12)","v":" "},{"$f":"IF('données d''entrée'!I12=0,0,'données d''entrée'!I12)","v":0},{"$f":"IF('données d''entrée'!J12=0,\" \",'données d''entrée'!J12)","v":" "},{"$f":"IF(OR(H10=\" \",J10=\" \"),\"\",(H10)*J10)","v":""},{"$f":"IF('données d''entrée'!L12=0,\" \",'données d''entrée'!L12)","v":""},{"$f":"IFERROR(_xlfn.IFS(\nAND(OR(B10=$B$197,B10=$B$199,B10=$B$200,B10=$B$201,B10=$B$202,B10=$B$203,B10=$B$204,B10=$B$205,B10=$B$207),L10>100),100,\nAND(OR(B10=$B$197,B10=$B$199,B10=$B$200,B10=$B$201,B10=$B$202,B10=$B$203,B10=$B$204,B10=$B$205,B10=$B$207),L10<=100),L10,\nAND(OR(B10=$B$196,B10=$B$198),L10>90),90,\nAND(OR(B10=$B$196,B10=$B$198),L10<=90),L10,\nOR(B10=\"\",B10=$B$206),L10),0)","v":0},{"$f":"IF('données d''entrée'!M12=0,\" \",'données d''entrée'!M12)","v":" "},{"$f":"IFERROR(IF(OR('données d''entrée'!N12<>0,AND('données d''entrée'!N12=0,N10-$R$8>=0)),'données d''entrée'!N12,\"\"),\"\")","v":""},{"$f":"IF(AND(E10<=7500,B10<>B197,B10<>B199,E10<>0),1,0)","v":0},0,null,null,null,null,null,null,null,"gaz naturel",{"$f":"IF('données d''entrée'!Q7=0,\" \",IF('Synthèse pour trame'!$B$82='Scénario 1'!Y10,'données d''entrée'!Q7*(1+'Synthèse pour trame'!$W$86),'données d''entrée'!Q7))","v":100},null,null,null,null,null,null,null,null,null,null,null,null,null,null,null,null,null,null,null,null,null,null,null,null,null,null,null,null,null,null,null,null,null,null,null,null,null,null,null,null,null,null,null,null,null,null,null,null,null,null,null,null,null,null,null,null,null,null,null,null,null,null,null,null,1]
[null,{"$f":"IF('données d''entrée'!B13=0,\" \",'données d''entrée'!B13)","v":" "},{"$f":"IF('données d''entrée'!C13=0,\" \",'données d''entrée'!C13)","v":" "},{"$f":"IF('données d''entrée'!D13=0,\" \",'données d''entrée'!D13)","v":" "},{"$f":"IF('données d''entrée'!E13=0,0,'données d''entrée'!E13)","v":0},{"$f":"IF('données d''entrée'!F13=0,\" \",'données d''entrée'!F13)","v":" "},{"$f":"IF('données d''entrée'!G13=0,\" \",'données d''entrée'!G13)","v":" "},{"$f":"IF('données d''entrée'!H13=0,\" \",'données d''entrée'!H13)","v":" "},{"$f":"IF('données d''entrée'!I13=0,0,'données d''entrée'!I13)","v":0},{"$f":"IF('données d''entrée'!J13=0,\" \",'données d''entrée'!J13)","v":" "},"",{"$f":"IF('données d''entrée'!L13=0,\" \",'données d''entrée'!L13)","v":""},{"$f":"IFERROR(_xlfn.IFS(\nAND(OR(B11=$B$197,B11=$B$199,B11=$B$200,B11=$B$201,B11=$B$202,B11=$B$203,B11=$B$204,B11=$B$205,B11=$B$207),L11>100),100,\nAND(OR(B11=$B$197,B11=$B$199,B11=$B$200,B11=$B$201,B11=$B$202,B11=$B$203,B11=$B$204,B11=$B$205,B11=$B$207),L11<=100),L11,\nAND(OR(B11=$B$196,B11=$B$198),L11>90),90,\nAND(OR(B11=$B$196,B11=$B$198),L11<=90),L11,\nOR(B11=\"\",B11=$B$206),L11),0)","v":0},{"$f":"IF('données d''entrée'!M13=0,\" \",'données d''entrée'!M13)","v":" "},{"$f":"IFERROR(IF(OR('données d''entrée'!N13<>0,AND('données d''entrée'!N13=0,N11-$R$8>=0)),'données d''entrée'!N13,\"\"),\"\")","v":""},0,0,null,null,null,null,null,null,null,"granulé",{"$f":"IF('données d''entrée'!Q8=0,\" \",IF('Synthèse pour trame'!$B$82='Scénario 1'!Y11,'données d''entrée'!Q8*(1+'Synthèse pour trame'!$W$86),'données d''entrée'!Q8))","v":77},null,null,null,null,null,null,null,null,null,null,null,null,null,null,null,null,null,null,null,null,null,null,null,null,null,null,null,null,null,null,null,null,null,null,null,null,null,null,null,null,null,null,null,null,null,null,null,null,null,null,null,null,null,null,null,null,null,null,null,null,null,null,null,null,1]
[null,{"$f":"IF('données d''entrée'!B14=0,\" \",'données d''entrée'!B14)","v":" "},{"$f":"IF('données d''entrée'!C14=0,\" \",'données d''entrée'!C14)","v":" "},{"$f":"IF('données d''entrée'!D14=0,\" \",'données d''entrée'!D14)","v":" "},{"$f":"IF('données d''entrée'!E14=0,0,'données d''entrée'!E14)","v":0},{"$f":"IF('données d''entrée'!F14=0,\" \",'données d''entrée'!F14)","v":" "},{"$f":"IF('données d''entrée'!G14=0,\" \",'données d''entrée'!G14)","v":" "},{"$f":"IF('données d''entrée'!H14=0,\" \",'données d''entrée'!H14)","v":" "},{"$f":"IF('données d''entrée'!I14=0,0,'données d''entrée'!I14)","v":0},{"$f":"IF('données d''entrée'!J14=0,\" \",'données d''entrée'!J14)","v":" "},"",{"$f":"IF('données d''entrée'!L14=0,\" \",'données d''entrée'!L14)","v":""},{"$f":"IFERROR(_xlfn.IFS(\nAND(OR(B12=$B$197,B12=$B$199,B12=$B$200,B12=$B$201,B12=$B$202,B12=$B$203,B12=$B$204,B12=$B$205,B12=$B$207),L12>100),100,\nAND(OR(B12=$B$197,B12=$B$199,B12=$B$200,B12=$B$201,B12=$B$202,B12=$B$203,B12=$B$204,B12=$B$205,B12=$B$207),L12<=100),L12,\nAND(OR(B12=$B$196,B12=$B$198),L12>90),90,\nAND(OR(B12=$B$196,B12=$B$198),L12<=90),L12,\nOR(B12=\"\",B12=$B$206),L12),0)","v":0},{"$f":"IF('données d''entrée'!M14=0,\" \",'données d''entrée'!M14)","v":" "},{"$f":"IFERROR(IF(OR('données d''entrée'!N14<>0,AND('données d''entrée'!N14=0,N12-$R$8>=0)),'données d''entrée'!N14,\"\"),\"\")","v":""},0,0,null,null,null,null,null,null,null,"propane",{"$f":"IF('données d''entrée'!Q9=0,\" \",IF('Synthèse pour trame'!$B$82='Scénario 1'!Y12,'données d''entrée'!Q9*(1+'Synthèse pour trame'!$W$86),'données d''entrée'!Q9))","v":117},null,null,null,null,null,null,null,null,null,null,null,null,null,null,null,null,null,null,null,null,null,null,null,null,null,null,null,null,null,null,null,null,null,null,null,null,null,null,null,null,null,null,null,null,null,null,null,null,null,null,null,null,null,null,null,null,null,null,null,null,null,null,null,null,1]
[null,{"$f":"IF('données d''entrée'!B15=0,\" \",'données d''entrée'!B15)","v":" "},{"$f":"IF('données d''entrée'!C15=0,\" \",'données d''entrée'!C15)","v":" "},{"$f":"IF('données d''entrée'!D15=0,\" \",'données d''entrée'!D15)","v":" "},{"$f":"IF('données d''entrée'!E15=0,0,'données d''entrée'!E15)","v":0},{"$f":"IF('données d''entrée'!F15=0,\" \",'données d''entrée'!F15)","v":" "},{"$f":"IF('données d''entrée'!G15=0,\" \",'données d''entrée'!G15)","v":" "},{"$f":"IF('données d''entrée'!H15=0,\" \",'données d''entrée'!H15)","v":" "},{"$f":"IF('données d''entrée'!I15=0,0,'données d''entrée'!I15)","v":0},{"$f":"IF('données d''entrée'!J15=0,\" \",'données d''entrée'!J15)","v":" "},"",{"$f":"IF('données d''entrée'!L15=0,\" \",'données d''entrée'!L15)","v":""},{"$f":"IFERROR(_xlfn.IFS(\nAND(OR(B13=$B$197,B13=$B$199,B13=$B$200,B13=$B$201,B13=$B$202,B13=$B$203,B13=$B$204,B13=$B$205,B13=$B$207),L13>100),100,\nAND(OR(B13=$B$197,B13=$B$199,B13=$B$200,B13=$B$201,B13=$B$202,B13=$B$203,B13=$B$204,B13=$B$205,B13=$B$207),L13<=100),L13,\nAND(OR(B13=$B$196,B13=$B$198),L13>90),90,\nAND(OR(B13=$B$196,B13=$B$198),L13<=90),L13,\nOR(B13=\"\",B13=$B$206),L13),0)","v":0},{"$f":"IF('données d''entrée'!M15=0,\" \",'données d''entrée'!M15)","v":" "},{"$f":"IFERROR(IF(OR('données d''entrée'!N15<>0,AND('données d''entrée'!N15=0,N13-$R$8>=0)),'données d''entrée'!N15,\"\"),\"\")","v":""},0,0,null,null,null,null,null,null,null,null,null,null,null,null,null,null,null,null,null,null,null,null,null,null,null,null,null,null,null,null,null,null,null,null,null,null,null,null,null,null,null,null,null,null,null,null,null,null,null,null,null,null,null,null,null,null,null,null,null,null,null,null,null,null,null,null,null,null,null,null,null,null,null,null,null,1]
[null,{"$f":"IF('données d''entrée'!B16=0,\" \",'données d''entrée'!B16)","v":" "},{"$f":"IF('données d''entrée'!C16=0,\" \",'données d''entrée'!C16)","v":" "},{"$f":"IF('données d''entrée'!D16=0,\" \",'données d''entrée'!D16)","v":" "},{"$f":"IF('données d''entrée'!E16=0,0,'données d''entrée'!E16)","v":0},{"$f":"IF('données d''entrée'!F16=0,\" \",'données d''entrée'!F16)","v":" "},{"$f":"IF('données d''entrée'!G16=0,\" \",'données d''entrée'!G16)","v":" "},{"$f":"IF('données d''entrée'!H16=0,\" \",'données d''entrée'!H16)","v":" "},{"$f":"IF('données d''entrée'!I16=0,0,'données d''entrée'!I16)","v":0},{"$f":"IF('données d''entrée'!J16=0,\" \",'données d''entrée'!J16)","v":" "},"",{"$f":"IF('données d''entrée'!L16=0,\" \",'données d''entrée'!L16)","v":""},{"$f":"IFERROR(_xlfn.IFS(\nAND(OR(B14=$B$197,B14=$B$199,B14=$B$200,B14=$B$201,B14=$B$202,B14=$B$203,B14=$B$204,B14=$B$205,B14=$B$207),L14>100),100,\nAND(OR(B14=$B$197,B14=$B$199,B14=$B$200,B14=$B$201,B14=$B$202,B14=$B$203,B14=$B$204,B14=$B$205,B14=$B$207),L14<=100),L14,\nAND(OR(B14=$B$196,B14=$B$198),L14>90),90,\nAND(OR(B14=$B$196,B14=$B$198),L14<=90),L14,\nOR(B14=\"\",B14=$B$206),L14),0)","v":0},{"$f":"IF('données d''entrée'!M16=0,\" \",'données d''entrée'!M16)","v":" "},{"$f":"IFERROR(IF(OR('données d''entrée'!N16<>0,AND('données d''entrée'!N16=0,N14-$R$8>=0)),'données d''entrée'!N16,\"\"),\"\")","v":""},0,0,null,null,null,null,null,null,null,null,null,null,null,null,null,null,null,null,null,null,null,null,null,null,null,null,null,null,null,null,null,null,null,null,null,null,null,null,null,null,null,null,null,null,null,null,null,null,null,null,null,null,null,null,null,null,null,null,null,null,null,null,null,null,null,null,null,null,null,null,null,null,null,null,null,1]
[null,{"$f":"IF('données d''entrée'!B17=0,\" \",'données d''entrée'!B17)","v":" "},{"$f":"IF('données d''entrée'!C17=0,\" \",'données d''entrée'!C17)","v":" "},{"$f":"IF('données d''entrée'!D17=0,\" \",'données d''entrée'!D17)","v":" "},{"$f":"IF('données d''entrée'!E17=0,0,'données d''entrée'!E17)","v":0},{"$f":"IF('données d''entrée'!F17=0,\" \",'données d''entrée'!F17)","v":" "},{"$f":"IF('données d''entrée'!G17=0,\" \",'données d''entrée'!G17)","v":" "},{"$f":"IF('données d''entrée'!H17=0,\" \",'données d''entrée'!H17)","v":" "},{"$f":"IF('données d''entrée'!I17=0,0,'données d''entrée'!I17)","v":0},{"$f":"IF('données d''entrée'!J17=0,\" \",'données d''entrée'!J17)","v":" "},"",{"$f":"IF('données d''entrée'!L17=0,\" \",'données d''entrée'!L17)","v":""},{"$f":"IFERROR(_xlfn.IFS(\nAND(OR(B15=$B$197,B15=$B$199,B15=$B$200,B15=$B$201,B15=$B$202,B15=$B$203,B15=$B$204,B15=$B$205,B15=$B$207),L15>100),100,\nAND(OR(B15=$B$197,B15=$B$199,B15=$B$200,B15=$B$201,B15=$B$202,B15=$B$203,B15=$B$204,B15=$B$205,B15=$B$207),L15<=100),L15,\nAND(OR(B15=$B$196,B15=$B$198),L15>90),90,\nAND(OR(B15=$B$196,B15=$B$198),L15<=90),L15,\nOR(B15=\"\",B15=$B$206),L15),0)","v":0},{"$f":"IF('données d''entrée'!M17=0,\" \",'données d''entrée'!M17)","v":" "},{"$f":"IFERROR(IF(OR('données d''entrée'!N17<>0,AND('données d''entrée'!N17=0,N15-$R$8>=0)),'données d''entrée'!N17,\"\"),\"\")","v":""},0,0,null,null,null,null,null,null,null,null,null,null,null,null,null,null,null,null,null,null,null,null,null,null,null,null,null,null,null,null,null,null,null,null,null,null,null,null,null,null,null,null,null,null,null,null,null,null,null,null,null,null,null,null,null,null,null,null,null,null,null,null,null,null,null,null,null,null,null,null,null,null,null,null,null,1]
[null,{"$f":"IF('données d''entrée'!B18=0,\" \",'données d''entrée'!B18)","v":" "},{"$f":"IF('données d''entrée'!C18=0,\" \",'données d''entrée'!C18)","v":" "},{"$f":"IF('données d''entrée'!D18=0,\" \",'données d''entrée'!D18)","v":" "},{"$f":"IF('données d''entrée'!E18=0,0,'données d''entrée'!E18)","v":0},{"$f":"IF('données d''entrée'!F18=0,\" \",'données d''entrée'!F18)","v":" "},{"$f":"IF('données d''entrée'!G18=0,\" \",'données d''entrée'!G18)","v":" "},{"$f":"IF('données d''entrée'!H18=0,\" \",'données d''entrée'!H18)","v":" "},{"$f":"IF('données d''entrée'!I18=0,0,'données d''entrée'!I18)","v":0},{"$f":"IF('données d''entrée'!J18=0,\" \",'données d''entrée'!J18)","v":" "},"",{"$f":"IF('données d''entrée'!L18=0,\" \",'données d''entrée'!L18)","v":""},{"$f":"IFERROR(_xlfn.IFS(\nAND(OR(B16=$B$197,B16=$B$199,B16=$B$200,B16=$B$201,B16=$B$202,B16=$B$203,B16=$B$204,B16=$B$205,B16=$B$207),L16>100),100,\nAND(OR(B16=$B$197,B16=$B$199,B16=$B$200,B16=$B$201,B16=$B$202,B16=$B$203,B16=$B$204,B16=$B$205,B16=$B$207),L16<=100),L16,\nAND(OR(B16=$B$196,B16=$B$198),L16>90),90,\nAND(OR(B16=$B$196,B16=$B$198),L16<=90),L16,\nOR(B16=\"\",B16=$B$206),L16),0)","v":0},{"$f":"IF('données d''entrée'!M18=0,\" \",'données d''entrée'!M18)","v":" "},{"$f":"IFERROR(IF(OR('données d''entrée'!N18<>0,AND('données d''entrée'!N18=0,N16-$R$8>=0)),'données d''entrée'!N18,\"\"),\"\")","v":""},0,0,null,null,null,null,null,null,null,null,null,null,null,null,null,null,null,null,null,null,null,null,null,null,null,null,null,null,null,null,null,null,null,null,null,null,null,null,null,null,null,null,null,null,null,null,null,null,null,null,null,null,null,null,null,null,null,null,null,null,null,null,null,null,null,null,null,null,null,null,null,null,null,null,null,1]
[null,{"$f":"IF('données d''entrée'!B19=0,\" \",'données d''entrée'!B19)","v":" "},{"$f":"IF('données d''entrée'!C19=0,\" \",'données d''entrée'!C19)","v":" "},{"$f":"IF('données d''entrée'!D19=0,\" \",'données d''entrée'!D19)","v":" "},{"$f":"IF('données d''entrée'!E19=0,0,'données d''entrée'!E19)","v":0},{"$f":"IF('données d''entrée'!F19=0,\" \",'données d''entrée'!F19)","v":" "},{"$f":"IF('données d''entrée'!G19=0,\" \",'données d''entrée'!G19)","v":" "},{"$f":"IF('données d''entrée'!H19=0,\" \",'données d''entrée'!H19)","v":" "},{"$f":"IF('données d''entrée'!I19=0,0,'données d''entrée'!I19)","v":0},{"$f":"IF('données d''entrée'!J19=0,\" \",'données d''entrée'!J19)","v":" "},"",{"$f":"IF('données d''entrée'!L19=0,\" \",'données d''entrée'!L19)","v":""},{"$f":"IFERROR(_xlfn.IFS(\nAND(OR(B17=$B$197,B17=$B$199,B17=$B$200,B17=$B$201,B17=$B$202,B17=$B$203,B17=$B$204,B17=$B$205,B17=$B$207),L17>100),100,\nAND(OR(B17=$B$197,B17=$B$199,B17=$B$200,B17=$B$201,B17=$B$202,B17=$B$203,B17=$B$204,B17=$B$205,B17=$B$207),L17<=100),L17,\nAND(OR(B17=$B$196,B17=$B$198),L17>90),90,\nAND(OR(B17=$B$196,B17=$B$198),L17<=90),L17,\nOR(B17=\"\",B17=$B$206),L17),0)","v":0},{"$f":"IF('données d''entrée'!M19=0,\" \",'données d''entrée'!M19)","v":" "},{"$f":"IFERROR(IF(OR('données d''entrée'!N19<>0,AND('données d''entrée'!N19=0,N17-$R$8>=0)),'données d''entrée'!N19,\"\"),\"\")","v":""},0,0,null,null,null,null,null,null,null,null,null,null,null,null,null,null,null,null,null,null,null,null,null,null,null,null,null,null,null,null,null,null,null,null,null,null,null,null,null,null,null,null,null,null,null,null,null,null,null,null,null,null,null,null,null,null,null,null,null,null,null,null,null,null,null,null,null,null,null,null,null,null,null,null,null,1]
[null,{"$f":"IF('données d''entrée'!B20=0,\" \",'données d''entrée'!B20)","v":" "},{"$f":"IF('données d''entrée'!C20=0,\" \",'données d''entrée'!C20)","v":" "},{"$f":"IF('données d''entrée'!D20=0,\" \",'données d''entrée'!D20)","v":" "},{"$f":"IF('données d''entrée'!E20=0,0,'données d''entrée'!E20)","v":0},{"$f":"IF('données d''entrée'!F20=0,\" \",'données d''entrée'!F20)","v":" "},{"$f":"IF('données d''entrée'!G20=0,\" \",'données d''entrée'!G20)","v":" "},{"$f":"IF('données d''entrée'!H20=0,\" \",'données d''entrée'!H20)","v":" "},{"$f":"IF('données d''entrée'!I20=0,0,'données d''entrée'!I20)","v":0},{"$f":"IF('données d''entrée'!J20=0,\" \",'données d''entrée'!J20)","v":" "},"",{"$f":"IF('données d''entrée'!L20=0,\" \",'données d''entrée'!L20)","v":""},{"$f":"IFERROR(_xlfn.IFS(\nAND(OR(B18=$B$197,B18=$B$199,B18=$B$200,B18=$B$201,B18=$B$202,B18=$B$203,B18=$B$204,B18=$B$205,B18=$B$207),L18>100),100,\nAND(OR(B18=$B$197,B18=$B$199,B18=$B$200,B18=$B$201,B18=$B$202,B18=$B$203,B18=$B$204,B18=$B$205,B18=$B$207),L18<=100),L18,\nAND(OR(B18=$B$196,B18=$B$198),L18>90),90,\nAND(OR(B18=$B$196,B18=$B$198),L18<=90),L18,\nOR(B18=\"\",B18=$B$206),L18),0)","v":0},{"$f":"IF('données d''entrée'!M20=0,\" \",'données d''entrée'!M20)","v":" "},{"$f":"IFERROR(IF(OR('données d''entrée'!N20<>0,AND('données d''entrée'!N20=0,N18-$R$8>=0)),'données d''entrée'!N20,\"\"),\"\")","v":""},0,0,null,null,null,null,null,null,null,null,null,null,null,null,null,null,null,null,null,null,null,null,null,null,null,null,null,null,null,null,null,null,null,null,null,null,null,null,null,null,null,null,null,null,null,null,null,null,null,null,null,null,null,null,null,null,null,null,null,null,null,null,null,null,null,null,null,null,null,null,null,null,null,null,null,1]
[null,{"$f":"IF('données d''entrée'!B21=0,\" \",'données d''entrée'!B21)","v":" "},{"$f":"IF('données d''entrée'!C21=0,\" \",'données d''entrée'!C21)","v":" "},{"$f":"IF('données d''entrée'!D21=0,\" \",'données d''entrée'!D21)","v":" "},{"$f":"IF('données d''entrée'!E21=0,0,'données d''entrée'!E21)","v":0},{"$f":"IF('données d''entrée'!F21=0,\" \",'données d''entrée'!F21)","v":" "},{"$f":"IF('données d''entrée'!G21=0,\" \",'données d''entrée'!G21)","v":" "},{"$f":"IF('données d''entrée'!H21=0,\" \",'données d''entrée'!H21)","v":" "},{"$f":"IF('données d''entrée'!I21=0,0,'données d''entrée'!I21)","v":0},{"$f":"IF('données d''entrée'!J21=0,\" \",'données d''entrée'!J21)","v":" "},"",{"$f":"IF('données d''entrée'!L21=0,\" \",'données d''entrée'!L21)","v":""},{"$f":"IFERROR(_xlfn.IFS(\nAND(OR(B19=$B$197,B19=$B$199,B19=$B$200,B19=$B$201,B19=$B$202,B19=$B$203,B19=$B$204,B19=$B$205,B19=$B$207),L19>100),100,\nAND(OR(B19=$B$197,B19=$B$199,B19=$B$200,B19=$B$201,B19=$B$202,B19=$B$203,B19=$B$204,B19=$B$205,B19=$B$207),L19<=100),L19,\nAND(OR(B19=$B$196,B19=$B$198),L19>90),90,\nAND(OR(B19=$B$196,B19=$B$198),L19<=90),L19,\nOR(B19=\"\",B19=$B$206),L19),0)","v":0},{"$f":"IF('données d''entrée'!M21=0,\" \",'données d''entrée'!M21)","v":" "},{"$f":"IFERROR(IF(OR('données d''entrée'!N21<>0,AND('données d''entrée'!N21=0,N19-$R$8>=0)),'données d''entrée'!N21,\"\"),\"\")","v":""},0,0,null,null,null,null,null,null,null,null,null,null,null,null,null,null,null,null,null,null,null,null,null,null,null,null,null,null,null,null,null,null,null,null,null,null,null,null,null,null,null,null,null,null,null,null,null,null,null,null,null,null,null,null,null,null,null,null,null,null,null,null,null,null,null,null,null,null,null,null,null,null,null,null,null,1]
[null,{"$f":"IF('données d''entrée'!B22=0,\" \",'données d''entrée'!B22)","v":" "},{"$f":"IF('données d''entrée'!C22=0,\" \",'données d''entrée'!C22)","v":" "},{"$f":"IF('données d''entrée'!D22=0,\" \",'données d''entrée'!D22)","v":" "},{"$f":"IF('données d''entrée'!E22=0,0,'données d''entrée'!E22)","v":0},{"$f":"IF('données d''entrée'!F22=0,\" \",'données d''entrée'!F22)","v":" "},{"$f":"IF('données d''entrée'!G22=0,\" \",'données d''entrée'!G22)","v":" "},{"$f":"IF('données d''entrée'!H22=0,\" \",'données d''entrée'!H22)","v":" "},{"$f":"IF('données d''entrée'!I22=0,0,'données d''entrée'!I22)","v":0},{"$f":"IF('données d''entrée'!J22=0,\" \",'données d''entrée'!J22)","v":" "},"",{"$f":"IF('données d''entrée'!L22=0,\" \",'données d''entrée'!L22)","v":""},{"$f":"IFERROR(_xlfn.IFS(\nAND(OR(B20=$B$197,B20=$B$199,B20=$B$200,B20=$B$201,B20=$B$202,B20=$B$203,B20=$B$204,B20=$B$205,B20=$B$207),L20>100),100,\nAND(OR(B20=$B$197,B20=$B$199,B20=$B$200,B20=$B$201,B20=$B$202,B20=$B$203,B20=$B$204,B20=$B$205,B20=$B$207),L20<=100),L20,\nAND(OR(B20=$B$196,B20=$B$198),L20>90),90,\nAND(OR(B20=$B$196,B20=$B$198),L20<=90),L20,\nOR(B20=\"\",B20=$B$206),L20),0)","v":0},{"$f":"IF('données d''entrée'!M22=0,\" \",'données d''entrée'!M22)","v":" "},{"$f":"IFERROR(IF(OR('données d''entrée'!N22<>0,AND('données d''entrée'!N22=0,N20-$R$8>=0)),'données d''entrée'!N22,\"\"),\"\")","v":""},0,0,null,null,null,null,null,null,null,null,null,null,null,null,null,null,null,null,null,null,null,null,null,null,null,null,null,null,null,null,null,null,null,null,null,null,null,null,null,null,null,null,null,null,null,null,null,null,null,null,null,null,null,null,null,null,null,null,null,null,null,null,null,null,null,null,null,null,null,null,null,null,null,null,null,1]
[null,{"$f":"IF('données d''entrée'!B23=0,\" \",'données d''entrée'!B23)","v":" "},{"$f":"IF('données d''entrée'!C23=0,\" \",'données d''entrée'!C23)","v":" "},{"$f":"IF('données d''entrée'!D23=0,\" \",'données d''entrée'!D23)","v":" "},{"$f":"IF('données d''entrée'!E23=0,0,'données d''entrée'!E23)","v":0},{"$f":"IF('données d''entrée'!F23=0,\" \",'données d''entrée'!F23)","v":" "},{"$f":"IF('données d''entrée'!G23=0,\" \",'données d''entrée'!G23)","v":" "},{"$f":"IF('données d''entrée'!H23=0,\" \",'données d''entrée'!H23)","v":" "},{"$f":"IF('données d''entrée'!I23=0,0,'données d''entrée'!I23)","v":0},{"$f":"IF('données d''entrée'!J23=0,\" \",'données d''entrée'!J23)","v":" "},"",{"$f":"IF('données d''entrée'!L23=0,\" \",'données d''entrée'!L23)","v":""},{"$f":"IFERROR(_xlfn.IFS(\nAND(OR(B21=$B$197,B21=$B$199,B21=$B$200,B21=$B$201,B21=$B$202,B21=$B$203,B21=$B$204,B21=$B$205,B21=$B$207),L21>100),100,\nAND(OR(B21=$B$197,B21=$B$199,B21=$B$200,B21=$B$201,B21=$B$202,B21=$B$203,B21=$B$204,B21=$B$205,B21=$B$207),L21<=100),L21,\nAND(OR(B21=$B$196,B21=$B$198),L21>90),90,\nAND(OR(B21=$B$196,B21=$B$198),L21<=90),L21,\nOR(B21=\"\",B21=$B$206),L21),0)","v":0},{"$f":"IF('données d''entrée'!M23=0,\" \",'données d''entrée'!M23)","v":" "},{"$f":"IFERROR(IF(OR('données d''entrée'!N23<>0,AND('données d''entrée'!N23=0,N21-$R$8>=0)),'données d''entrée'!N23,\"\"),\"\")","v":""},0,0,null,null,null,null,null,null,null,null,null,null,null,null,null,null,null,null,null,null,null,null,null,null,null,null,null,null,null,null,null,null,null,null,null,null,null,null,null,null,null,null,null,null,null,null,null,null,null,null,null,null,null,null,null,null,null,null,null,null,null,null,null,null,null,null,null,null,null,null,null,null,null,null,null,1]
[null,{"$f":"IF('données d''entrée'!B24=0,\" \",'données d''entrée'!B24)","v":" "},{"$f":"IF('données d''entrée'!C24=0,\" \",'données d''entrée'!C24)","v":" "},{"$f":"IF('données d''entrée'!D24=0,\" \",'données d''entrée'!D24)","v":" "},{"$f":"IF('données d''entrée'!E24=0,0,'données d''entrée'!E24)","v":0},{"$f":"IF('données d''entrée'!F24=0,\" \",'données d''entrée'!F24)","v":" "},{"$f":"IF('données d''entrée'!G24=0,\" \",'données d''entrée'!G24)","v":" "},{"$f":"IF('données d''entrée'!H24=0,\" \",'données d''entrée'!H24)","v":" "},{"$f":"IF('données d''entrée'!I24=0,0,'données d''entrée'!I24)","v":0},{"$f":"IF('données d''entrée'!J24=0,\" \",'données d''entrée'!J24)","v":" "},"",{"$f":"IF('données d''entrée'!L24=0,\" \",'données d''entrée'!L24)","v":""},{"$f":"IFERROR(_xlfn.IFS(\nAND(OR(B22=$B$197,B22=$B$199,B22=$B$200,B22=$B$201,B22=$B$202,B22=$B$203,B22=$B$204,B22=$B$205,B22=$B$207),L22>100),100,\nAND(OR(B22=$B$197,B22=$B$199,B22=$B$200,B22=$B$201,B22=$B$202,B22=$B$203,B22=$B$204,B22=$B$205,B22=$B$207),L22<=100),L22,\nAND(OR(B22=$B$196,B22=$B$198),L22>90),90,\nAND(OR(B22=$B$196,B22=$B$198),L22<=90),L22,\nOR(B22=\"\",B22=$B$206),L22),0)","v":0},{"$f":"IF('données d''entrée'!M24=0,\" \",'données d''entrée'!M24)","v":" "},{"$f":"IFERROR(IF(OR('données d''entrée'!N24<>0,AND('données d''entrée'!N24=0,N22-$R$8>=0)),'données d''entrée'!N24,\"\"),\"\")","v":""},0,0,null,null,null,null,null,null,null,null,null,null,null,null,null,null,null,null,null,null,null,null,null,null,null,null,null,null,null,null,null,null,null,null,null,null,null,null,null,null,null,null,null,null,null,null,null,null,null,null,null,null,null,null,null,null,null,null,null,null,null,null,null,null,null,null,null,null,null,null,null,null,null,null,null,1]
[null,{"$f":"IF('données d''entrée'!B25=0,\" \",'données d''entrée'!B25)","v":" "},{"$f":"IF('données d''entrée'!C25=0,\" \",'données d''entrée'!C25)","v":" "},{"$f":"IF('données d''entrée'!D25=0,\" \",'données d''entrée'!D25)","v":" "},{"$f":"IF('données d''entrée'!E25=0,0,'données d''entrée'!E25)","v":0},{"$f":"IF('données d''entrée'!F25=0,\" \",'données d''entrée'!F25)","v":" "},{"$f":"IF('données d''entrée'!G25=0,\" \",'données d''entrée'!G25)","v":" "},{"$f":"IF('données d''entrée'!H25=0,\" \",'données d''entrée'!H25)","v":" "},{"$f":"IF('données d''entrée'!I25=0,0,'données d''entrée'!I25)","v":0},{"$f":"IF('données d''entrée'!J25=0,\" \",'données d''entrée'!J25)","v":" "},"",{"$f":"IF('données d''entrée'!L25=0,\" \",'données d''entrée'!L25)","v":""},{"$f":"IFERROR(_xlfn.IFS(\nAND(OR(B23=$B$197,B23=$B$199,B23=$B$200,B23=$B$201,B23=$B$202,B23=$B$203,B23=$B$204,B23=$B$205,B23=$B$207),L23>100),100,\nAND(OR(B23=$B$197,B23=$B$199,B23=$B$200,B23=$B$201,B23=$B$202,B23=$B$203,B23=$B$204,B23=$B$205,B23=$B$207),L23<=100),L23,\nAND(OR(B23=$B$196,B23=$B$198),L23>90),90,\nAND(OR(B23=$B$196,B23=$B$198),L23<=90),L23,\nOR(B23=\"\",B23=$B$206),L23),0)","v":0},{"$f":"IF('données d''entrée'!M25=0,\" \",'données d''entrée'!M25)","v":" "},{"$f":"IFERROR(IF(OR('données d''entrée'!N25<>0,AND('données d''entrée'!N25=0,N23-$R$8>=0)),'données d''entrée'!N25,\"\"),\"\")","v":""},0,0,null,null,null,null,null,null,null,null,null,null,null,null,null,null,null,null,null,null,null,null,null,null,null,null,null,null,null,null,null,null,null,null,null,null,null,null,null,null,null,null,null,null,null,null,null,null,null,null,null,null,null,null,null,null,null,null,null,null,null,null,null,null,null,null,null,null,null,null,null,null,null,null,null,1]
[null,{"$f":"IF('données d''entrée'!B26=0,\" \",'données d''entrée'!B26)","v":" "},{"$f":"IF('données d''entrée'!C26=0,\" \",'données d''entrée'!C26)","v":" "},{"$f":"IF('données d''entrée'!D26=0,\" \",'données d''entrée'!D26)","v":" "},{"$f":"IF('données d''entrée'!E26=0,0,'données d''entrée'!E26)","v":0},{"$f":"IF('données d''entrée'!F26=0,\" \",'données d''entrée'!F26)","v":" "},{"$f":"IF('données d''entrée'!G26=0,\" \",'données d''entrée'!G26)","v":" "},{"$f":"IF('données d''entrée'!H26=0,\" \",'données d''entrée'!H26)","v":" "},{"$f":"IF('données d''entrée'!I26=0,0,'données d''entrée'!I26)","v":0},{"$f":"IF('données d''entrée'!J26=0,\" \",'données d''entrée'!J26)","v":" "},"",{"$f":"IF('données d''entrée'!L26=0,\" \",'données d''entrée'!L26)","v":""},{"$f":"IFERROR(_xlfn.IFS(\nAND(OR(B24=$B$197,B24=$B$199,B24=$B$200,B24=$B$201,B24=$B$202,B24=$B$203,B24=$B$204,B24=$B$205,B24=$B$207),L24>100),100,\nAND(OR(B24=$B$197,B24=$B$199,B24=$B$200,B24=$B$201,B24=$B$202,B24=$B$203,B24=$B$204,B24=$B$205,B24=$B$207),L24<=100),L24,\nAND(OR(B24=$B$196,B24=$B$198),L24>90),90,\nAND(OR(B24=$B$196,B24=$B$198),L24<=90),L24,\nOR(B24=\"\",B24=$B$206),L24),0)","v":0},{"$f":"IF('données d''entrée'!M26=0,\" \",'données d''entrée'!M26)","v":" "},{"$f":"IFERROR(IF(OR('données d''entrée'!N26<>0,AND('données d''entrée'!N26=0,N24-$R$8>=0)),'données d''entrée'!N26,\"\"),\"\")","v":""},0,0,null,null,null,null,null,null,null,null,null,null,null,null,null,null,null,null,null,null,null,null,null,null,null,null,null,null,null,null,null,null,null,null,null,null,null,null,null,null,null,null,null,null,null,null,null,null,null,null,null,null,null,null,null,null,null,null,null,null,null,null,null,null,null,null,null,null,null,null,null,null,null,null,null,1]
[null,{"$f":"IF('données d''entrée'!B27=0,\" \",'données d''entrée'!B27)","v":" "},{"$f":"IF('données d''entrée'!C27=0,\" \",'données d''entrée'!C27)","v":" "},{"$f":"IF('données d''entrée'!D27=0,\" \",'données d''entrée'!D27)","v":" "},{"$f":"IF('données d''entrée'!E27=0,0,'données d''entrée'!E27)","v":0},{"$f":"IF('données d''entrée'!F27=0,\" \",'données d''entrée'!F27)","v":" "},{"$f":"IF('données d''entrée'!G27=0,\" \",'données d''entrée'!G27)","v":" "},{"$f":"IF('données d''entrée'!H27=0,\" \",'données d''entrée'!H27)","v":" "},{"$f":"IF('données d''entrée'!I27=0,0,'données d''entrée'!I27)","v":0},{"$f":"IF('données d''entrée'!J27=0,\" \",'données d''entrée'!J27)","v":" "},"",{"$f":"IF('données d''entrée'!L27=0,\" \",'données d''entrée'!L27)","v":""},{"$f":"IFERROR(_xlfn.IFS(\nAND(OR(B25=$B$197,B25=$B$199,B25=$B$200,B25=$B$201,B25=$B$202,B25=$B$203,B25=$B$204,B25=$B$205,B25=$B$207),L25>100),100,\nAND(OR(B25=$B$197,B25=$B$199,B25=$B$200,B25=$B$201,B25=$B$202,B25=$B$203,B25=$B$204,B25=$B$205,B25=$B$207),L25<=100),L25,\nAND(OR(B25=$B$196,B25=$B$198),L25>90),90,\nAND(OR(B25=$B$196,B25=$B$198),L25<=90),L25,\nOR(B25=\"\",B25=$B$206),L25),0)","v":0},{"$f":"IF('données d''entrée'!M27=0,\" \",'données d''entrée'!M27)","v":" "},{"$f":"IFERROR(IF(OR('données d''entrée'!N27<>0,AND('données d''entrée'!N27=0,N25-$R$8>=0)),'données d''entrée'!N27,\"\"),\"\")","v":""},0,0,null,null,null,null,null,null,null,null,null,null,null,null,null,null,null,null,null,null,null,null,null,null,null,null,null,null,null,null,null,null,null,null,null,null,null,null,null,null,null,null,null,null,null,null,null,null,null,null,null,null,null,null,null,null,null,null,null,null,null,null,null,null,null,null,null,null,null,null,null,null,null,null,null,1]
[null,{"$f":"IF('données d''entrée'!B28=0,\" \",'données d''entrée'!B28)","v":" "},{"$f":"IF('données d''entrée'!C28=0,\" \",'données d''entrée'!C28)","v":" "},{"$f":"IF('données d''entrée'!D28=0,\" \",'données d''entrée'!D28)","v":" "},{"$f":"IF('données d''entrée'!E28=0,0,'données d''entrée'!E28)","v":0},{"$f":"IF('données d''entrée'!F28=0,\" \",'données d''entrée'!F28)","v":" "},{"$f":"IF('données d''entrée'!G28=0,\" \",'données d''entrée'!G28)","v":" "},{"$f":"IF('données d''entrée'!H28=0,\" \",'données d''entrée'!H28)","v":" "},{"$f":"IF('données d''entrée'!I28=0,0,'données d''entrée'!I28)","v":0},{"$f":"IF('données d''entrée'!J28=0,\" \",'données d''entrée'!J28)","v":" "},"",{"$f":"IF('données d''entrée'!L28=0,\" \",'données d''entrée'!L28)","v":""},{"$f":"IFERROR(_xlfn.IFS(\nAND(OR(B26=$B$197,B26=$B$199,B26=$B$200,B26=$B$201,B26=$B$202,B26=$B$203,B26=$B$204,B26=$B$205,B26=$B$207),L26>100),100,\nAND(OR(B26=$B$197,B26=$B$199,B26=$B$200,B26=$B$201,B26=$B$202,B26=$B$203,B26=$B$204,B26=$B$205,B26=$B$207),L26<=100),L26,\nAND(OR(B26=$B$196,B26=$B$198),L26>90),90,\nAND(OR(B26=$B$196,B26=$B$198),L26<=90),L26,\nOR(B26=\"\",B26=$B$206),L26),0)","v":0},{"$f":"IF('données d''entrée'!M28=0,\" \",'données d''entrée'!M28)","v":" "},{"$f":"IFERROR(IF(OR('données d''entrée'!N28<>0,AND('données d''entrée'!N28=0,N26-$R$8>=0)),'données d''entrée'!N28,\"\"),\"\")","v":""},0,0,null,null,null,null,null,null,null,null,null,null,null,null,null,null,null,null,null,null,null,null,null,null,null,null,null,null,null,null,null,null,null,null,null,null,null,null,null,null,null,null,null,null,null,null,null,null,null,null,null,null,null,null,null,null,null,null,null,null,null,null,null,null,null,null,null,null,null,null,null,null,null,null,null,1]
[null,{"$f":"IF('données d''entrée'!B29=0,\" \",'données d''entrée'!B29)","v":" "},{"$f":"IF('données d''entrée'!C29=0,\" \",'données d''entrée'!C29)","v":" "},{"$f":"IF('données d''entrée'!D29=0,\" \",'données d''entrée'!D29)","v":" "},{"$f":"IF('données d''entrée'!E29=0,0,'données d''entrée'!E29)","v":0},{"$f":"IF('données d''entrée'!F29=0,\" \",'données d''entrée'!F29)","v":" "},{"$f":"IF('données d''entrée'!G29=0,\" \",'données d''entrée'!G29)","v":" "},{"$f":"IF('données d''entrée'!H29=0,\" \",'données d''entrée'!H29)","v":" "},{"$f":"IF('données d''entrée'!I29=0,0,'données d''entrée'!I29)","v":0},{"$f":"IF('données d''entrée'!J29=0,\" \",'données d''entrée'!J29)","v":" "},"",{"$f":"IF('données d''entrée'!L29=0,\" \",'données d''entrée'!L29)","v":""},{"$f":"IFERROR(_xlfn.IFS(\nAND(OR(B27=$B$197,B27=$B$199,B27=$B$200,B27=$B$201,B27=$B$202,B27=$B$203,B27=$B$204,B27=$B$205,B27=$B$207),L27>100),100,\nAND(OR(B27=$B$197,B27=$B$199,B27=$B$200,B27=$B$201,B27=$B$202,B27=$B$203,B27=$B$204,B27=$B$205,B27=$B$207),L27<=100),L27,\nAND(OR(B27=$B$196,B27=$B$198),L27>90),90,\nAND(OR(B27=$B$196,B27=$B$198),L27<=90),L27,\nOR(B27=\"\",B27=$B$206),L27),0)","v":0},{"$f":"IF('données d''entrée'!M29=0,\" \",'données d''entrée'!M29)","v":" "},{"$f":"IFERROR(IF(OR('données d''entrée'!N29<>0,AND('données d''entrée'!N29=0,N27-$R$8>=0)),'données d''entrée'!N29,\"\"),\"\")","v":""},0,0,null,null,null,null,null,null,null,null,null,null,null,null,null,null,null,null,null,null,null,null,null,null,null,null,null,null,null,null,null,null,null,null,null,null,null,null,null,null,null,null,null,null,null,null,null,null,null,null,null,null,null,null,null,null,null,null,null,null,null,null,null,null,null,null,null,null,null,null,null,null,null,null,null,{"$f":"SUM(CM8:CM26)+1","v":20}]
[null,{"$f":"IF('données d''entrée'!B30=0,\" \",'données d''entrée'!B30)","v":" "},{"$f":"IF('données d''entrée'!C30=0,\" \",'données d''entrée'!C30)","v":" "},{"$f":"IF('données d''entrée'!D30=0,\" \",'données d''entrée'!D30)","v":" "},{"$f":"IF('données d''entrée'!E30=0,0,'données d''entrée'!E30)","v":0},{"$f":"IF('données d''entrée'!F30=0,\" \",'données d''entrée'!F30)","v":" "},{"$f":"IF('données d''entrée'!G30=0,\" \",'données d''entrée'!G30)","v":" "},{"$f":"IF('données d''entrée'!H30=0,\" \",'données d''entrée'!H30)","v":" "},{"$f":"IF('données d''entrée'!I30=0,0,'données d''entrée'!I30)","v":0},{"$f":"IF('données d''entrée'!J30=0,\" \",'données d''entrée'!J30)","v":" "},"",{"$f":"IF('données d''entrée'!L30=0,\" \",'données d''entrée'!L30)","v":""},{"$f":"IFERROR(_xlfn.IFS(\nAND(OR(B28=$B$197,B28=$B$199,B28=$B$200,B28=$B$201,B28=$B$202,B28=$B$203,B28=$B$204,B28=$B$205,B28=$B$207),L28>100),100,\nAND(OR(B28=$B$197,B28=$B$199,B28=$B$200,B28=$B$201,B28=$B$202,B28=$B$203,B28=$B$204,B28=$B$205,B28=$B$207),L28<=100),L28,\nAND(OR(B28=$B$196,B28=$B$198),L28>90),90,\nAND(OR(B28=$B$196,B28=$B$198),L28<=90),L28,\nOR(B28=\"\",B28=$B$206),L28),0)","v":0},{"$f":"IF('données d''entrée'!M30=0,\" \",'données d''entrée'!M30)","v":" "},{"$f":"IFERROR(IF(OR('données d''entrée'!N30<>0,AND('données d''entrée'!N30=0,N28-$R$8>=0)),'données d''entrée'!N30,\"\"),\"\")","v":""},0,0]
[null,{"$f":"IF('données d''entrée'!B31=0,\" \",'données d''entrée'!B31)","v":" "},{"$f":"IF('données d''entrée'!C31=0,\" \",'données d''entrée'!C31)","v":" "},{"$f":"IF('données d''entrée'!D31=0,\" \",'données d''entrée'!D31)","v":" "},{"$f":"IF('données d''entrée'!E31=0,0,'données d''entrée'!E31)","v":0},{"$f":"IF('données d''entrée'!F31=0,\" \",'données d''entrée'!F31)","v":" "},{"$f":"IF('données d''entrée'!G31=0,\" \",'données d''entrée'!G31)","v":" "},{"$f":"IF('données d''entrée'!H31=0,\" \",'données d''entrée'!H31)","v":" "},{"$f":"IF('données d''entrée'!I31=0,0,'données d''entrée'!I31)","v":0},{"$f":"IF('données d''entrée'!J31=0,\" \",'données d''entrée'!J31)","v":" "},"",{"$f":"IF('données d''entrée'!L31=0,\" \",'données d''entrée'!L31)","v":""},{"$f":"IFERROR(_xlfn.IFS(\nAND(OR(B29=$B$197,B29=$B$199,B29=$B$200,B29=$B$201,B29=$B$202,B29=$B$203,B29=$B$204,B29=$B$205,B29=$B$207),L29>100),100,\nAND(OR(B29=$B$197,B29=$B$199,B29=$B$200,B29=$B$201,B29=$B$202,B29=$B$203,B29=$B$204,B29=$B$205,B29=$B$207),L29<=100),L29,\nAND(OR(B29=$B$196,B29=$B$198),L29>90),90,\nAND(OR(B29=$B$196,B29=$B$198),L29<=90),L29,\nOR(B29=\"\",B29=$B$206),L29),0)","v":0},{"$f":"IF('données d''entrée'!M31=0,\" \",'données d''entrée'!M31)","v":" "},{"$f":"IFERROR(IF(OR('données d''entrée'!N31<>0,AND('données d''entrée'!N31=0,N29-$R$8>=0)),'données d''entrée'!N31,\"\"),\"\")","v":""},0,0]
[null,{"$f":"IF('données d''entrée'!B32=0,\" \",'données d''entrée'!B32)","v":" "},{"$f":"IF('données d''entrée'!C32=0,\" \",'données d''entrée'!C32)","v":" "},{"$f":"IF('données d''entrée'!D32=0,\" \",'données d''entrée'!D32)","v":" "},{"$f":"IF('données d''entrée'!E32=0,0,'données d''entrée'!E32)","v":0},{"$f":"IF('données d''entrée'!F32=0,\" \",'données d''entrée'!F32)","v":" "},{"$f":"IF('données d''entrée'!G32=0,\" \",'données d''entrée'!G32)","v":" "},{"$f":"IF('données d''entrée'!H32=0,\" \",'données d''entrée'!H32)","v":" "},{"$f":"IF('données d''entrée'!I32=0,0,'données d''entrée'!I32)","v":0},{"$f":"IF('données d''entrée'!J32=0,\" \",'données d''entrée'!J32)","v":" "},"",{"$f":"IF('données d''entrée'!L32=0,\" \",'données d''entrée'!L32)","v":""},{"$f":"IFERROR(_xlfn.IFS(\nAND(OR(B30=$B$197,B30=$B$199,B30=$B$200,B30=$B$201,B30=$B$202,B30=$B$203,B30=$B$204,B30=$B$205,B30=$B$207),L30>100),100,\nAND(OR(B30=$B$197,B30=$B$199,B30=$B$200,B30=$B$201,B30=$B$202,B30=$B$203,B30=$B$204,B30=$B$205,B30=$B$207),L30<=100),L30,\nAND(OR(B30=$B$196,B30=$B$198),L30>90),90,\nAND(OR(B30=$B$196,B30=$B$198),L30<=90),L30,\nOR(B30=\"\",B30=$B$206),L30),0)","v":0},{"$f":"IF('données d''entrée'!M32=0,\" \",'données d''entrée'!M32)","v":" "},{"$f":"IFERROR(IF(OR('données d''entrée'!N32<>0,AND('données d''entrée'!N32=0,N30-$R$8>=0)),'données d''entrée'!N32,\"\"),\"\")","v":""},0,0]
[null,{"$f":"IF('données d''entrée'!B33=0,\" \",'données d''entrée'!B33)","v":" "},{"$f":"IF('données d''entrée'!C33=0,\" \",'données d''entrée'!C33)","v":" "},{"$f":"IF('données d''entrée'!D33=0,\" \",'données d''entrée'!D33)","v":" "},{"$f":"IF('données d''entrée'!E33=0,0,'données d''entrée'!E33)","v":0},{"$f":"IF('données d''entrée'!F33=0,\" \",'données d''entrée'!F33)","v":" "},{"$f":"IF('données d''entrée'!G33=0,\" \",'données d''entrée'!G33)","v":" "},{"$f":"IF('données d''entrée'!H33=0,\" \",'données d''entrée'!H33)","v":" "},{"$f":"IF('données d''entrée'!I33=0,0,'données d''entrée'!I33)","v":0},{"$f":"IF('données d''entrée'!J33=0,\" \",'données d''entrée'!J33)","v":" "},"",{"$f":"IF('données d''entrée'!L33=0,\" \",'données d''entrée'!L33)","v":""},{"$f":"IFERROR(_xlfn.IFS(\nAND(OR(B31=$B$197,B31=$B$199,B31=$B$200,B31=$B$201,B31=$B$202,B31=$B$203,B31=$B$204,B31=$B$205,B31=$B$207),L31>100),100,\nAND(OR(B31=$B$197,B31=$B$199,B31=$B$200,B31=$B$201,B31=$B$202,B31=$B$203,B31=$B$204,B31=$B$205,B31=$B$207),L31<=100),L31,\nAND(OR(B31=$B$196,B31=$B$198),L31>90),90,\nAND(OR(B31=$B$196,B31=$B$198),L31<=90),L31,\nOR(B31=\"\",B31=$B$206),L31),0)","v":0},{"$f":"IF('données d''entrée'!M33=0,\" \",'données d''entrée'!M33)","v":" "},{"$f":"IFERROR(IF(OR('données d''entrée'!N33<>0,AND('données d''entrée'!N33=0,N31-$R$8>=0)),'données d''entrée'!N33,\"\"),\"\")","v":""},0,0]
[null,{"$f":"IF('données d''entrée'!B34=0,\" \",'données d''entrée'!B34)","v":" "},{"$f":"IF('données d''entrée'!C34=0,\" \",'données d''entrée'!C34)","v":" "},{"$f":"IF('données d''entrée'!D34=0,\" \",'données d''entrée'!D34)","v":" "},{"$f":"IF('données d''entrée'!E34=0,0,'données d''entrée'!E34)","v":0},{"$f":"IF('données d''entrée'!F34=0,\" \",'données d''entrée'!F34)","v":" "},{"$f":"IF('données d''entrée'!G34=0,\" \",'données d''entrée'!G34)","v":" "},{"$f":"IF('données d''entrée'!H34=0,\" \",'données d''entrée'!H34)","v":" "},{"$f":"IF('données d''entrée'!I34=0,0,'données d''entrée'!I34)","v":0},{"$f":"IF('données d''entrée'!J34=0,\" \",'données d''entrée'!J34)","v":" "},"",{"$f":"IF('données d''entrée'!L34=0,\" \",'données d''entrée'!L34)","v":""},{"$f":"IFERROR(_xlfn.IFS(\nAND(OR(B32=$B$197,B32=$B$199,B32=$B$200,B32=$B$201,B32=$B$202,B32=$B$203,B32=$B$204,B32=$B$205,B32=$B$207),L32>100),100,\nAND(OR(B32=$B$197,B32=$B$199,B32=$B$200,B32=$B$201,B32=$B$202,B32=$B$203,B32=$B$204,B32=$B$205,B32=$B$207),L32<=100),L32,\nAND(OR(B32=$B$196,B32=$B$198),L32>90),90,\nAND(OR(B32=$B$196,B32=$B$198),L32<=90),L32,\nOR(B32=\"\",B32=$B$206),L32),0)","v":0},{"$f":"IF('données d''entrée'!M34=0,\" \",'données d''entrée'!M34)","v":" "},{"$f":"IFERROR(IF(OR('données d''entrée'!N34<>0,AND('données d''entrée'!N34=0,N32-$R$8>=0)),'données d''entrée'!N34,\"\"),\"\")","v":""},0,0]
[null,{"$f":"IF('données d''entrée'!B35=0,\" \",'données d''entrée'!B35)","v":" "},{"$f":"IF('données d''entrée'!C35=0,\" \",'données d''entrée'!C35)","v":" "},{"$f":"IF('données d''entrée'!D35=0,\" \",'données d''entrée'!D35)","v":" "},{"$f":"IF('données d''entrée'!E35=0,0,'données d''entrée'!E35)","v":0},{"$f":"IF('données d''entrée'!F35=0,\" \",'données d''entrée'!F35)","v":" "},{"$f":"IF('données d''entrée'!G35=0,\" \",'données d''entrée'!G35)","v":" "},{"$f":"IF('données d''entrée'!H35=0,\" \",'données d''entrée'!H35)","v":" "},{"$f":"IF('données d''entrée'!I35=0,0,'données d''entrée'!I35)","v":0},{"$f":"IF('données d''entrée'!J35=0,\" \",'données d''entrée'!J35)","v":" "},"",{"$f":"IF('données d''entrée'!L35=0,\" \",'données d''entrée'!L35)","v":""},{"$f":"IFERROR(_xlfn.IFS(\nAND(OR(B33=$B$197,B33=$B$199,B33=$B$200,B33=$B$201,B33=$B$202,B33=$B$203,B33=$B$204,B33=$B$205,B33=$B$207),L33>100),100,\nAND(OR(B33=$B$197,B33=$B$199,B33=$B$200,B33=$B$201,B33=$B$202,B33=$B$203,B33=$B$204,B33=$B$205,B33=$B$207),L33<=100),L33,\nAND(OR(B33=$B$196,B33=$B$198),L33>90),90,\nAND(OR(B33=$B$196,B33=$B$198),L33<=90),L33,\nOR(B33=\"\",B33=$B$206),L33),0)","v":0},{"$f":"IF('données d''entrée'!M35=0,\" \",'données d''entrée'!M35)","v":" "},{"$f":"IFERROR(IF(OR('données d''entrée'!N35<>0,AND('données d''entrée'!N35=0,N33-$R$8>=0)),'données d''entrée'!N35,\"\"),\"\")","v":""},0,0]
[null,null,null,null,{"$f":"SUM(E9:E33)","v":0},null,{"$f":"SUM(G9:G33)","v":0},{"$f":"SUM(H9:H33)","v":0},0,{"$f":"IFERROR(AVERAGE(J9:J33),0)","v":0},{"$f":"IFERROR(SUM(K9:K33),0)","v":0},{"$f":"IFERROR(AVERAGE(L9:L33),\"\")","v":""},null,null,{"$f":"(AVERAGE(O9:O33))","v":{"$error":"#DIV/0!"}}]
[null,null,null,null,null,null,null,null,null,null,null,null,null,null,null,null,"10/ CHIFFRAGE SCENARIO DE REFERENCE"]
[null,"2/ SCENARIO DE REFERENCE",null,null,null,null,null,null,null,null,null,null,null,null,null,null,"Caractéristiques de l'installation dans le Scénario de Référence"]
[null,"Caractéristiques de l'installation dans le Scénario de Référence",null,null,null,null,null,null,null,null,null,null,null,null,null,null,"Bâtiments",{"$f":"IF(OR(W8=\"oui\",W7=\"oui\"),\"investissement HTVA\",\"investissement TTC\")","v":"investissement HTVA"},{"$f":"IF(OR(W8=\"oui\",W7=\"oui\"),\"Coût unitaire de l'énergie (€/MWh HTVA)\",\"Coût unitaire de l'énergie (€/MWh TTC)\")","v":"Coût unitaire de l'énergie (€/MWh HTVA)"},{"$f":"IF(OR(W8=\"oui\",W7=\"oui\"),\"Coût de l'énergie annuelle P1 (€ HTVA)\",\"Coût de l'énergie annuelle P1 (€ TTC)\")","v":"Coût de l'énergie annuelle P1 (€ HTVA)"},{"$f":"IF(OR(W8=\"oui\",W7=\"oui\"),\"Coût de maintenance annuelle P2 (€ HTVA)\",\"Coût de maintenance annuelle P2 (€ TTC)\")","v":"Coût de maintenance annuelle P2 (€ HTVA)"},{"$f":"IF(OR(W8=\"oui\",W7=\"oui\"),\"GER P3 (€ HTVA)\",\"GER P3 (€ TTC)\")","v":"GER P3 (€ HTVA)"},{"$f":"IF(OR(W8=\"oui\",W7=\"oui\"),\"Coût des annuités P4 (€ HTVA)\",\"Coût des annuités P4 (€ TTC)\")","v":"Coût des annuités P4 (€ HTVA)"},"durée amortissement",{"$f":"IF(OR(W8=\"oui\",W7=\"oui\"),\"Dépenses d'exploitation totales référence (€ HTVA)\",\"Dépenses d'exploitation totales référence(€ TTC)\")","v":"Dépenses d'exploitation totales référence (€ HTVA)"},{"$f":"IF(OR(W8=\"oui\",W7=\"oui\"),\"Coût par MWh (€ HTVA)\",\"Coût par MWh (€ TTC)\")","v":"Coût par MWh (€ HTVA)"}]
[null,"Bâtiment(s)","Nature des travaux envisagés sur la production de chauffage","énergie de référence choisie","économies d'énergie (% de réduction)","puissance de référence (kW)","consommation moyenne sur 3 ans\n( chauffage + ECS ; MWh PCI)","Consommation d'ECS (si non connue, 0)","Rendement de production","besoin utile MWh",null,null,null,null,null,null,{"$f":"B39","v":" "},{"$f":"IFERROR(IF(F39=0,0,IF($C39=\"\",0,IF($F39=0,0,IF(OR($W$8=\"oui\",$W$7=\"oui\"),IF(N9-$R$8>=0,1,O9)*IF(AND($F39>9,$F39<151),0.57*$F39^2+76*$F39+2500,IF(AND($F39>150,$F39<951),56.1*$F39+18300,IF(AND($F39>950,$F39<14501),34.3*$F39+39000,IF($F39>14500,20.3*$F39+242000,\"\")))),O9*IF(AND($F39>9,$F39<151),0.57*$F39^2+76*$F39+2500,IF(AND($F39>150,$F39<951),56.1*$F39+18300,IF(AND($F39>950,$F39<14501),34.3*$F39+39000,IF($F39>14500,20.3*$F39+242000,\"\"))))*(1+$W$9)))))*1.3,0)","v":0},{"$f":"IF(OR(D39=\"à définir\",D39=\"\"),\"\",IF(OR($W$8=\"oui\",$W$7=\"oui\"),IF(D39=\"pac\",VLOOKUP(\"électricité\",$Y$7:$Z$12,2),VLOOKUP(D39,$Y$7:$Z$12,2)),IF(OR(D39=\"granulé\",D39=\"Bois déchiqueté\"),VLOOKUP(D39,$Y$7:$Z$12,2)*1.1,IF(D39=\"pac\",VLOOKUP(\"électricité\",$Y$7:$Z$12,2)*1.2,VLOOKUP(D39,$Y$7:$Z$12,2)*1.2))))","v":""},{"$f":"IF(S38=\"\",0,S38*G39)","v":0},{"$f":"IF(F39=\"\",0,IF(OR($W$8=\"oui\",$W$7=\"oui\"),IF(AND(F39>1,F39<8.99),250,IF(AND(F39>9,F39<96),0.18*F39^2-7.6*F39+300,IF(AND(F39>95,F39<951),6.6*F39+530,IF(AND(F39>950,F39<3501),F39+5800,IF(F39>3500,3.2*F39-1900,\"\"))))),IF(AND(F39>1,F39<8.99),250,IF(AND(F39>9,F39<96),0.18*F39^2-7.6*F39+300,IF(AND(F39>95,F39<951),6.6*F39+530,IF(AND(F39>950,F39<3501),F39+5800,IF(F39>3500,3.2*F39-1900,\"\")))))*(1+$W$9)))*1.3","v":0},{"$f":"0.01*R38","v":0},{"$f":"IFERROR(IF(X38=\"\",-PMT($AA$83,$Z$83,R38),-PMT($AA$83,X38,R38)),0)","v":0},null,{"$f":"W38+V38+U38+T38","v":0},{"$f":"IFERROR(IF(J39=0,0,Y38/J39),0)","v":0}]
[null,{"$f":"IF(D9=0,\"\",D9)","v":" "},null,null,{"$f":"IF('Synthèse pour trame'!$W$84<>0,'Synthèse pour trame'!$W$84,IF('Synthèse pour trame'!$W$80=\"Non\",0,'Synthèse pour trame'!$W$81))","v":0},null,{"$f":"IFERROR(IF(H9=0,0,(1-E39)*H9*J9/I39),0)","v":0},{"$f":"IFERROR(IF(K9=0,0,I9*J9/I39*(1-E39)),0)","v":0},{"$f":"IF(D39=\"PAC\",300%,IF(ISBLANK(D39)=TRUE,\"\",90%))","v":""},{"$f":"IFERROR(IF(K9=0,\"\",(G39)*I39),\"\")","v":""},null,null,null,null,null,null," ",0,"",0,0,{"$f":"0.01*R39","v":0},0,null,{"$f":"W39+V39+U39+T39","v":0},0]
[null," ",null,null,{"$f":"IF('Synthèse pour trame'!$W$84<>0,'Synthèse pour trame'!$W$84,IF('Synthèse pour trame'!$W$80=\"Non\",0,'Synthèse pour trame'!$W$81))","v":0},null,{"$f":"IFERROR(IF(H10=0,0,(1-E40)*H10*J10/I40),0)","v":0},{"$f":"IFERROR(IF(K10=0,0,I10*J10/I40*(1-E40)),0)","v":0},{"$f":"IF(D40=\"PAC\",300%,IF(ISBLANK(D40)=TRUE,\"\",90%))","v":""},{"$f":"IFERROR(IF(K10=0,\"\",(G40)*I40),\"\")","v":""},null,null,null,null,null,null," ",0,"",0,0,0,0,null,0,0]
[null," ",null,null,{"$f":"IF('Synthèse pour trame'!$W$84<>0,'Synthèse pour trame'!$W$84,IF('Synthèse pour trame'!$W$80=\"Non\",0,'Synthèse pour trame'!$W$81))","v":0},null,0,0,"","",null,null,null,null,null,null," ",0,"",0,0,0,0,null,0,0]
[null," ",null,null,{"$f":"IF('Synthèse pour trame'!$W$84<>0,'Synthèse pour trame'!$W$84,IF('Synthèse pour trame'!$W$80=\"Non\",0,'Synthèse pour trame'!$W$81))","v":0},null,0,0,"","",null,null,null,null,null,null," ",0,"",0,0,0,0,null,0,0]
[null," ",null,null,{"$f":"IF('Synthèse pour trame'!$W$84<>0,'Synthèse pour trame'!$W$84,IF('Synthèse pour trame'!$W$80=\"Non\",0,'Synthèse pour trame'!$W$81))","v":0},null,0,0,"","",null,null,null,null,null,null," ",0,"",0,0,0,0,null,0,0]
[null," ",null,null,{"$f":"IF('Synthèse pour trame'!$W$84<>0,'Synthèse pour trame'!$W$84,IF('Synthèse pour trame'!$W$80=\"Non\",0,'Synthèse pour trame'!$W$81))","v":0},null,0,0,"","",null,null,null,null,null,null," ",0,"",0,0,0,0,null,0,0]
[null," ",null,null,{"$f":"IF('Synthèse pour trame'!$W$84<>0,'Synthèse pour trame'!$W$84,IF('Synthèse pour trame'!$W$80=\"Non\",0,'Synthèse pour trame'!$W$81))","v":0},null,0,0,"","",null,null,null,null,null,null," ",0,"",0,0,0,0,null,0,0]
[null," ",null,null,{"$f":"IF('Synthèse pour trame'!$W$84<>0,'Synthèse pour trame'!$W$84,IF('Synthèse pour trame'!$W$80=\"Non\",0,'Synthèse pour trame'!$W$81))","v":0},null,0,0,"","",null,null,null,null,null,null," ",0,"",0,0,0,0,null,0,0]
[null," ",null,null,{"$f":"IF('Synthèse pour trame'!$W$84<>0,'Synthèse pour trame'!$W$84,IF('Synthèse pour trame'!$W$80=\"Non\",0,'Synthèse pour trame'!$W$81))","v":0},null,0,0,"","",null,null,null,null,null,null," ",0,"",0,0,0,0,null,0,0]
[null," ",null,null,{"$f":"IF('Synthèse pour trame'!$W$84<>0,'Synthèse pour trame'!$W$84,IF('Synthèse pour trame'!$W$80=\"Non\",0,'Synthèse pour trame'!$W$81))","v":0},null,0,0,"","",null,null,null,null,null,null," ",0,"",0,0,0,0,null,0,0]
[null," ",null,null,{"$f":"IF('Synthèse pour trame'!$W$84<>0,'Synthèse pour trame'!$W$84,IF('Synthèse pour trame'!$W$80=\"Non\",0,'Synthèse pour trame'!$W$81))","v":0},null,0,0,"","",null,null,null,null,null,null," ",0,"",0,0,0,0,null,0,0]
[null," ",null,null,{"$f":"IF('Synthèse pour trame'!$W$84<>0,'Synthèse pour trame'!$W$84,IF('Synthèse pour trame'!$W$80=\"Non\",0,'Synthèse pour trame'!$W$81))","v":0},null,0,0,"","",null,null,null,null,null,null," ",0,"",0,0,0,0,null,0,0]
[null," ",null,null,{"$f":"IF('Synthèse pour trame'!$W$84<>0,'Synthèse pour trame'!$W$84,IF('Synthèse pour trame'!$W$80=\"Non\",0,'Synthèse pour trame'!$W$81))","v":0},null,0,0,"","",null,null,null,null,null,null," ",0,"",0,0,0,0,null,0,0]
[null," ",null,null,{"$f":"IF('Synthèse pour trame'!$W$84<>0,'Synthèse pour trame'!$W$84,IF('Synthèse pour trame'!$W$80=\"Non\",0,'Synthèse pour trame'!$W$81))","v":0},null,0,0,"","",null,null,null,null,null,null," ",0,"",0,0,0,0,null,0,0]
[null," ",null,null,{"$f":"IF('Synthèse pour trame'!$W$84<>0,'Synthèse pour trame'!$W$84,IF('Synthèse pour trame'!$W$80=\"Non\",0,'Synthèse pour trame'!$W$81))","v":0},null,0,0,"","",null,null,null,null,null,null," ",0,"",0,0,0,0,null,0,0]
[null," ",null,null,{"$f":"IF('Synthèse pour trame'!$W$84<>0,'Synthèse pour trame'!$W$84,IF('Synthèse pour trame'!$W$80=\"Non\",0,'Synthèse pour trame'!$W$81))","v":0},null,0,0,"","",null,null,null,null,null,null," ",0,"",0,0,0,0,null,0,0]
[null," ",null,null,{"$f":"IF('Synthèse pour trame'!$W$84<>0,'Synthèse pour trame'!$W$84,IF('Synthèse pour trame'!$W$80=\"Non\",0,'Synthèse pour trame'!$W$81))","v":0},null,0,0,"","",null,null,null,null,null,null," ",0,"",0,0,0,0,null,0,0]
[null," ",null,null,{"$f":"IF('Synthèse pour trame'!$W$84<>0,'Synthèse pour trame'!$W$84,IF('Synthèse pour trame'!$W$80=\"Non\",0,'Synthèse pour trame'!$W$81))","v":0},null,0,0,"","",null,null,null,null,null,null," ",0,"",0,0,0,0,null,0,0]
[null," ",null,null,{"$f":"IF('Synthèse pour trame'!$W$84<>0,'Synthèse pour trame'!$W$84,IF('Synthèse pour trame'!$W$80=\"Non\",0,'Synthèse pour trame'!$W$81))","v":0},null,0,0,"","",null,null,null,null,null,null," ",0,"",0,0,0,0,null,0,0]
[null," ",null,null,{"$f":"IF('Synthèse pour trame'!$W$84<>0,'Synthèse pour trame'!$W$84,IF('Synthèse pour trame'!$W$80=\"Non\",0,'Synthèse pour trame'!$W$81))","v":0},null,0,0,"","",null,null,null,null,null,null," ",0,"",0,0,0,0,null,0,0]
[null," ",null,null,{"$f":"IF('Synthèse pour trame'!$W$84<>0,'Synthèse pour trame'!$W$84,IF('Synthèse pour trame'!$W$80=\"Non\",0,'Synthèse pour trame'!$W$81))","v":0},null,0,0,"","",null,null,null,null,null,null," ",0,"",0,0,0,0,null,0,0]
[null," ",null,null,{"$f":"IF('Synthèse pour trame'!$W$84<>0,'Synthèse pour trame'!$W$84,IF('Synthèse pour trame'!$W$80=\"Non\",0,'Synthèse pour trame'!$W$81))","v":0},null,0,0,"","",null,null,null,null,null,null," ",0,"",0,0,0,0,null,0,0]
[null," ",null,null,{"$f":"IF('Synthèse pour trame'!$W$84<>0,'Synthèse pour trame'!$W$84,IF('Synthèse pour trame'!$W$80=\"Non\",0,'Synthèse pour trame'!$W$81))","v":0},null,0,0,"","",null,null,null,null,null,null," ",0,"",0,0,0,0,null,0,0]
[null," ",null,null,{"$f":"IF('Synthèse pour trame'!$W$84<>0,'Synthèse pour trame'!$W$84,IF('Synthèse pour trame'!$W$80=\"Non\",0,'Synthèse pour trame'!$W$81))","v":0},null,0,0,"","",null,null,null,null,null,null," ",0,"",0,0,0,0,null,0,0]
[null," ",null,null,{"$f":"IF('Synthèse pour trame'!$W$84<>0,'Synthèse pour trame'!$W$84,IF('Synthèse pour trame'!$W$80=\"Non\",0,'Synthèse pour trame'!$W$81))","v":0},null,0,0,"","",null,null,null,null,null,null,"Total",{"$f":"SUM(R38:R62)","v":0},null,{"$f":"SUM(T38:T62)","v":0},{"$f":"SUM(U38:U62)","v":0},{"$f":"SUM(V38:V62)","v":0},{"$f":"SUM(W38:W62)","v":0},null,{"$f":"SUM(Y38:Y62)","v":0}]
[null,null,null,null,"Total",{"$f":"SUM(F39:F63)","v":0},{"$f":"SUM(G39:G63)","v":0},{"$f":"SUM(H39:H63)","v":0},{"$f":"SUMPRODUCT(I39:I63,G39:G63)/G64","v":{"$error":"#DIV/0!"}},{"$f":"SUM(J39:J63)","v":0}]
[]
[null,null,null,null,null,null,null,null,null,null,null,null,null,null,null,null,"11/ CHIFFRAGE SCENARIO BOIS"]
[null,"3/ SCENARIO BOIS",null,null,null,null,null,null,null,null,null,null,null,null,null,null,"travaux à prévoir pour la solution Bois",null,null,null,null,null,{"$f":"IF(OR(W8=\"oui\",W7=\"oui\"),\"Détail des dépenses d'exploitation (€/MWh HTVA)\",\"Détail des dépenses d'exploitation (€/MWh TTC)\")","v":"Détail des dépenses d'exploitation (€/MWh HTVA)"}]
[null,"Energie à fournir par bâtiment par la chaufferie bois ou le réseau",null,null,null,null,null,null,null,null,null,null,null,null,null,null,"postes de dépenses","caractéristiques",{"$f":"IF(OR(W8=\"oui\",W7=\"oui\"),\"investissement HTVA\",\"investissement TTC\")","v":"investissement HTVA"},"taux subv.","solde",null,"MWh bois entrée chaufferie",null,null,null,null,{"$f":"C106","v":0}]
[null,"Bâtiment(s)","Nature des travaux envisagés sur la production de chauffage","puissance à fournir par la chaufferie bois ou la sous station (kW)","besoins utiles (MWh) sortie chaudière ou  livrés en sous station",null,null,null,null,null,null,null,null,null,null,null,"chaudière bois / puissance :",{"$f":"C99","v":0},null,{"$f":"U119","v":0},{"$f":"(1-T69)*S69","v":0},null,{"$f":"\"MWh fossile entrée chaufferie\"&IF(F114=\"Oui\",\"dont P1 géothermie\",\"\")","v":"MWh fossile entrée chaufferie"},null,null,null,null,{"$f":"C107+IF(F114=\"Oui\",F119,0)","v":0}]
[null,{"$f":"IF(D9=0,\"\",D9)","v":" "},null,{"$f":"IF(OR(I70=\"\",I70=0),F39,\"à préciser\")","v":0},{"$f":"IF(J39=\"\",0,IF(G39=\"\",0,J39))","v":0},null,null,null,null,null,null,null,null,null,null,null,"hydraulique et électricité en chaufferie",null,null,{"$f":"T69","v":0},0,null,"P1",null,null,null,null,{"$f":"SUM(AB71:AB72)","v":0}]
[null," ",null,{"$f":"IF(OR(I71=\"\",I71=0),F40,\"à préciser\")","v":0},0,null,null,null,null,null,null,null,null,null,null,null,"fumisterie",null,null,{"$f":"T69","v":0},0,null,"MWh bois entrée chaufferie - P1 bois",null,"coût du MWh bois :",null,{"$f":"IF(OR(C103=\"\",C103=\"à définir\"),\"définir le type de combustible en F40\",VLOOKUP(C103,Y7:Z12,2))","v":"définir le type de combustible en F40"},{"$f":"IF(OR(C103=\"\",C103=\"à définir\"),0,IF(OR($W$8=\"oui\",$W$7=\"oui\"),AB68*AA71,AB68*AA71*(1+0.1)))","v":0}]
[null," ",null,{"$f":"IF(OR(I72=\"\",I72=0),F41,\"à préciser\")","v":0},0,null,null,null,null,null,null,null,null,null,null,null,"traitement des fumées",null,null,{"$f":"T69","v":0},{"$f":"(1-T72)*S72","v":0},null,"MWh fossile entrée chaufferie - P1 appoint.",null,"coût du MWh appoint :",null,{"$f":"IF(C104=\"aucun\",\"\",IF(OR(C104=\"\",C104=\"à définir\"),\"définir le type de combustible en F41\",VLOOKUP(C104,Y7:Z12,2)))","v":"définir le type de combustible en F41"},{"$f":"IF(C104=\"aucun\",0,IF(OR(C104=\"\",C104=\"à définir\"),0,IF(OR($W$8=\"oui\",$W$7=\"oui\"),AB69*AA72,AB69*AA72*(1+$W$9))))","v":0}]
[null," ",null,0,0,null,null,null,null,null,null,null,null,null,null,null,"régulation",null,null,{"$f":"T69","v":0},{"$f":"(1-T73)*S73","v":0},null,"P2",null,null,null,null,{"$f":"SUM(AB74:AB77)","v":0}]
[null," ",null,0,0,null,null,null,null,null,null,null,null,null,null,null,"imprévus chaufferie bois",null,null,{"$f":"T70","v":0},{"$f":"(1-T74)*S74","v":0},null,"Electricité","% de la production",0.01,"coût du MWh électrique : ",{"$f":"Z8","v":200},{"$f":"IF(OR($W$8=\"oui\",$W$7=\"oui\"),S102*Y74*AA74,S102*Y74*AA74*(1+W9))","v":0}]
[null," ",null,0,0,null,null,null,null,null,null,null,null,null,null,null,"imprévus chaufferie bois - pour synthèse trame",null,{"$f":"IF('Synthèse pour trame'!W85<>0,V74*'Synthèse pour trame'!W85,0)","v":0},{"$f":"IF(S75<0,1,T69)","v":0},{"$f":"(1-T75)*S75","v":0},null,"Entretien courant premier niveau (interne)",null,{"$f":"IF(N102=0,0,(31*5*0.25)+(8*1.5)+(2*0.5)+(1*N102))","v":0},"heures","cout interne (45€/h)",{"$f":"Y75*45","v":0}]
[null," ",null,0,0,null,null,null,null,null,null,null,null,null,null,null,"Total équipements chaufferie bois",null,{"$f":"SUM(S69:S75)","v":0},null,{"$f":"SUM(U69:U75)","v":0},null,"contrat d'entretien maintenance",null,null,"ratio de coût de maintenance :",11,{"$f":"AA76*C99","v":0}]
[null," ",null,0,0,null,null,null,null,null,null,null,null,null,null,null,"trémie silo",null,{"$f":"715*R69*0.15","v":0},{"$f":"T69","v":0},{"$f":"(1-T77)*S77","v":0},null,"Autres charges P2 (couplage)",null,null,null,null,{"$f":"IF(C114=\"Oui\",C119)+IF(F114=\"Oui\",F120)","v":0}]
[null," ",null,0,0,null,null,null,null,null,null,null,null,null,null,null,"voirie, vrd - surcout spécifique",null,0,{"$f":"T69","v":0},0,null,"P3",null,null,null,null,{"$f":"SUM(AB79:AB80)","v":0}]
[null," ",null,0,0,null,null,null,null,null,null,null,null,null,null,null,"génie civil et vrd classique",null,null,{"$f":"T69","v":0},0,null,"P3 gros entretien",null,0.01,null,null,{"$f":"IF(OR($W$8=\"oui\",$W$7=\"oui\"),Y79*(S76+S83+S85),Y79*(S76+S83+S85)*(1+W9))","v":0}]
[null," ",null,0,0,null,null,null,null,null,null,null,null,null,null,null,"Total batiment chaufferie bois",null,{"$f":"SUM(S77:S79)","v":0},null,{"$f":"SUM(U77:U79)","v":0},null,"Autres charges P3 (couplage)",null,null,null,null,{"$f":"IF(C114=\"Oui\",C120)+IF(F114=\"Oui\",F121)","v":0}]
[null," ",null,0,0,null,null,null,null,null,null,null,null,null,null,null,"chaudière d'appoint /                    puissance :",{"$f":"C100","v":0},{"$f":"R81*140","v":0},"non éligible",{"$f":"S81","v":0},null,"P4",null,null,"Durée de l'emprunt","Taux d'emprunt",{"$f":"SUM(AB82:AB83)","v":{"$error":"#NUM!"}}]
[null," ",null,0,0,null,null,null,null,null,null,null,null,null,null,null,"imprévus appoint",null,null,"non éligible",{"$f":"S82","v":0},null,"annuité lots techniques",null,"durée",null,null,{"$f":"-PMT(AA82,Z82,U76+U83+U85+U77)","v":{"$error":"#NUM!"}}]
[null," ",null,0,0,null,null,null,null,null,null,null,null,null,null,null,"Total appoint",null,{"$f":"SUM(S81:S82)","v":0},null,{"$f":"SUM(U81:U82)","v":0},null,"annuité lots gros œuvre",null,"durée",null,null,{"$f":"-PMT(AA83,Z83,U78+U79+U84+U86+U93)","v":{"$error":"#NUM!"}}]
[null," ",null,0,0,null,null,null,null,null,null,null,null,null,null,null,"réseau de chaleur /                           longueur : ",{"$f":"D190","v":0},{"$f":"F190","v":0},{"$f":"T69","v":0},{"$f":"IF(S84=0,0,(1-T84)*S84)","v":0}]
[null," ",null,0,0,null,null,null,null,null,null,null,null,null,null,null,"sous-stations /                                   nombre :",null,{"$f":"IF(R85=0,0,R85*13000+26*C98)","v":0},{"$f":"T70","v":0},{"$f":"IF(S85=0,0,(1-T85)*S85)","v":0}]
[null," ",null,0,0,null,null,null,null,null,null,null,null,null,null,null,"imprévus réseau",null,null,{"$f":"T71","v":0},0]
[null," ",null,0,0,null,null,null,null,null,null,null,null,null,null,null,"Total réseau",null,{"$f":"SUM(S84:S86)","v":0},null,{"$f":"SUM(U84:U86)","v":0},null,null,"ANALYSE DE SENSIBILITE"]
[null," ",null,0,0,null,null,null,null,null,null,null,null,null,null,null,"Total couplage(s)",{"$f":"IF(C114=\"Oui\",\"Solaire Thermique\",\"\")&\"/\"& IF(F114=\"Oui\",\"Géothermie\",\"\")","v":"/"},{"$f":"IF(C114=\"Oui\",C117)+IF(F114=\"Oui\",F117)","v":0},null,null,null,null,"Prix MWh cumac",{"$f":"'données d''entrée'!Q30","v":7.5}]
[null," ",null,0,0,null,null,null,null,null,null,null,null,null,null,null,"Total équipements (hors équipements secondaires)",null,{"$f":"S76+S80+S83+S87+S88","v":0},{"$f":"S89-U89","v":0},{"$f":"U76+U80+U83+U87","v":0},null,null,"Inflation maintenance :",{"$f":"IF('données d''entrée'!Q31=0,\" \",'données d''entrée'!Q31)","v":0.02}]
[null," ",null,0,0,null,null,null,null,null,null,null,null,null,null,null,null,null,null,null,null,null,null,"Inflation énergie bois :",{"$f":"IF('données d''entrée'!Q32=0,\" \",'données d''entrée'!Q32)","v":0.01}]
[null," ",null,0,0,null,null,null,null,null,null,null,null,null,null,null,"mision de maîtrise d'œuvre /                                   taux :",0.12,{"$f":"S89*R91","v":0},{"$f":"T69","v":0},{"$f":"(1-T91)*S91","v":0},null,null,"Inflation énergie électrique :",{"$f":"IF('données d''entrée'!Q33=0,\" \",'données d''entrée'!Q33)","v":0.04}]
[null," ",null,0,0,null,null,null,null,null,null,null,null,null,null,null,"imprévus étude et Moe",null,0,{"$f":"T69","v":0},0,null,null,"Inflation énergie fossile :",{"$f":"IF('données d''entrée'!Q34=0,\" \",'données d''entrée'!Q34)","v":0.03}]
[null," ",null,0,0,null,null,null,null,null,null,null,null,null,null,null,"total maitrise d'œuvre",{"$f":"S93/S89","v":{"$error":"#DIV/0!"}},{"$f":"SUM(S91:S92)","v":0},{"$f":"S93-U93","v":0},{"$f":"SUM(U91:U92)","v":0}]
[null," ",null,0,0]
[null,null,null,null,null,null,null,null,null,null,null,null,null,null,null,null,"coût Total  du projet",null,{"$f":"S93+S89","v":0},{"$f":"S95-U95","v":0},{"$f":"U89+U93","v":0},{"$f":"IF(S95>2000000,IF(S95/S102<=11,\"OK\",\"PAS D'EFFICIENCE ECONOMIQUE\"),\"\")","v":""}]
[null,"4/ DIMENSIONNEMENT CHAUFFERIE BOIS",null,null,null,null,null,null,null,null,null,null,null,null,null,null,"coût Total  du projet éligible",null,{"$f":"S76+S80+S87+S93","v":0}]
[null,"Caractéristique de l'installation bois",null,null,null,null,null,null,"Dimensionnement silo (facultatif)",null,null,null,null,null,null,null,"surcout du projet",null,{"$f":"S95-R63","v":0},null,{"$f":"U95-R63","v":0}]
[null,"Puissance totale délivrée (kW)",{"$f":"SUM(D70:D94)","v":0},null,null,null,null,null,"puissance bois",{"$f":"C99","v":0},"kW",null,null,null,null,null,null,null,null,null,null,null,"13/SYNTHESE SCENARIO BOIS / CRITERES ELIGIBILITE DU PBEB"]
[null,"Puissance Bois (kW)",null,"temps fonctionnement pleine puissance (heures)",null,{"$f":"IF(C99=0,0,C106*C109/C99*1000)","v":0},null,null,"autonomie pleine puissance",null,"jours",null,null,null,null,null,"12/ CALCUL DES AIDES pour la SOLUTION BOIS",null,null,null,null,"Coef coup de pouce TERTIAIRE","économie de fonctionnement annuelle après subvention, année 1 (hors annuités)",null,null,null,{"$f":"T63+U63+V63-AB70-AB73-AB78","v":0}]
[null,"Puissance Appoint en chaufferie (kW)",null,null,null,null,null,null,"masse volumique du bois",{"$f":"IF(C103=\"bois déchiqueté\",IF(N100<35%,0.25,0.33),IF(C103=\"granulé\",0.6,\"renseigner en C59\"))","v":"renseigner en C59"},"tonne/m3","Humidité du bois : ",null,null,null,null,"Critères de calcul de l'aide:","Petite entreprise","Activité économique","Collectif ou tertaire","Tertiaire",{"$f":"IFERROR((COUNTIF('Scénario 1'!$F$9:$F$33,\"gaz naturel\")*3+COUNTIF('Scénario 1'!$F$9:$F$33,\"fioul\")*4+COUNTIF('Scénario 1'!$F$9:$F$33,\"PAC\")*5+COUNTIF('Scénario 1'!$F$9:$F$33,\"propane\")*3+COUNTIF('Scénario 1'!$F$9:$F$33,\"PAC\")+COUNTIF('Scénario 1'!$F$9:$F$33,\"granulé\")+COUNTIF('Scénario 1'!$F$9:$F$35,\"bois déchiqueté\")+COUNTIF('Scénario 1'!$F$9:$F$35,\"électricité\"))/(COUNTIF('Scénario 1'!$F$9:$F$33,\"gaz naturel\")+COUNTIF('Scénario 1'!$F$9:$F$33,\"fioul\")+COUNTIF('Scénario 1'!$F$9:$F$33,\"PAC\")+COUNTIF('Scénario 1'!$F$9:$F$33,\"propane\")+COUNTIF('Scénario 1'!$F$9:$F$33,\"PAC\")+COUNTIF('Scénario 1'!$F$9:$F$33,\"granulé\")+COUNTIF('Scénario 1'!$F$9:$F$33,\"bois déchiqueté\")+COUNTIF('Scénario 1'!$F$9:$F$33,\"électricité\")),1)","v":1},"temps de retour avant subvention (ans)",null,null,null,{"$f":"IF(AA99=0,\"\",(S95-R63)/AA99)","v":""}]
[null,null,null,null,null,null,null,null,"PCI bois",{"$f":"(5080-58*N100*100)","v":5080},"KWh/tonne","volume par livraison :",null,null,null,null,"réseau technique","100% ENR","Projet sans gouvernance citoyenne","Projet chaufferie déchiqueté","Chauffage seul ",null,"temps de retour, après subvention (ans)",null,null,null,{"$f":"IF(AA99=0,\"\",(U95-R63)/AA99)","v":""}]
[null,"besoins utiles livrés ou sortie chaud. (MWh)",null,null,null,{"$f":"ROUND(SUM(E70:E94)-IF(C114=\"Oui\",C118)-IF(F114=\"Oui\",F118),0)","v":0},null,null,"volume utile",{"$f":"J98*24*J99/J101/J100","v":{"$error":"#VALUE!"}},"m3","nombre de livraison :",null,{"$f":"IF(AND(ISNUMBER(J100)=TRUE,N101>0),ROUND(E106/J100/N101,0),0)","v":0},null,null,"MWh bois sorties chaudière :",null,{"$f":"F103/F110","v":0},null,{"$f":"CONCATENATE(\"soit \",ROUND(S102/11.63,0),\" tep\")","v":"soit 0 tep"},null,"temps de retour actualisé, après subvention (ans)",null,null,null,{"$f":"IF(CM27<=19,CM27,\">20 ans\")","v":">20 ans"}]
[null,"énergie bois prévue :",null,"taux de couverture bois :",null,{"$f":"E103*F102","v":0},null,null,"volume total",{"$f":"J102/N103","v":{"$error":"#VALUE!"}},"m3","taux de remplissage silo",null,null,null,null,"MWh bois éligibles (si plafonnement) :",null,{"$f":"IFERROR(IF(T101=\"Projet chaufferie granulé\",MIN(240,S102,SUMPRODUCT(_xlfn._xlws.FILTER(M9:M33,M9:M33>0),_xlfn._xlws.FILTER(E9:E33,E9:E33>0))/1000+I34*J34),MIN(S102,SUMPRODUCT(_xlfn._xlws.FILTER(M9:M33,M9:M33>0),_xlfn._xlws.FILTER(E9:E33,E9:E33>0))/1000+I34*J34)),0)","v":0},{"$f":"IFERROR(\"Eligible sur \"&IF(ROUND(S103/K34*100,0)>100,100,ROUND(S103/K34*100,0))&\"% des besoins globaux\",0)","v":0},null,null,"coût chaufferie bois par kW (€)",null,null,null,{"$f":"IF(C99=0,0,(S80+S76+S83)/C99)","v":0}]
[null,"énergie d'appoint prévue :",null,"taux de couverture appoint :",{"$f":"1-E103","v":1},{"$f":"E104*F102","v":0},{"$f":"IFERROR(IF(F104/C100>500,\"TROP D'APPOINT FOSSILE SI NEUF\",\"OK\"),\"\")","v":""},null,"Capacité utile",{"$f":"J102*J100","v":{"$error":"#VALUE!"}},"tonnes",null,null,null,null,null,null,null,"aide forfaitaire calculée sans plafond RGEC (plafond aide FC + CEE pris en compte)","aide retenue selon plafond RGEC",null,null,"coût réseau par ml (sous-station comprise) (€)",null,null,null,{"$f":"IF(OR(R84=0,R84=\"\"),\"\",(S84+S85+S86)/R84)","v":""}]
[null,null,null,null,null,null,null,null,"Capacité totale",{"$f":"J103*J100","v":{"$error":"#VALUE!"}},"tonnes",null,null,null,null,null,null,null,null,null,{"$f":"IF(S100=\"activité non économique\",\"% investissement\",\"% investissement (hors appoint)\")","v":"% investissement (hors appoint)"},null,"chiffre d'affaire (hors marge)",null,null,null,{"$f":"V174","v":0}]
[null,"consommation bois entrée chaufferie",{"$f":"ROUND(F103/C109/F110,0)","v":0},"soit ",{"$f":"C106*1000/(5080-58*N100*100)","v":0},"tonnes",null,null,null,null,null,null,null,null,null,null,"1-Aide production de chaleur",null,{"$f":"SUM(S107:S110)","v":0},null,null,null,"tonnes de bois consommées",null,null,null,{"$f":"E106","v":0}]
[null,"consommation appoint entrée chaufferie",{"$f":"ROUND(F104/C110/F110,0)","v":0},null,null,null,null,null,null,null,null,null,null,null,null,null,"Aide ADEME - Fonds chaleur sans plafonnement CEE",{"$f":"IF(T100=\"Agricole, artisanal ou Industriel\",IF(S103<600,240*S103,IF(AND(S103>600,S103<3000),240*600+(S103-600)*120,IF(AND(S103>3000,S103<6000),240*600+120*2400+(S103-3000)*60,240*600+120*2400+60*3000+(S103-6000)*20))),IF(S103<600,420*S103,IF(AND(S103>600,S103<3000),420*600+(S103-600)*170,IF(AND(S103>3000,S103<6000),420*600+170*2400+(S103-3000)*80,420*600+170*2400+80*3000+(S103-6000)*50))))","v":0},null,null,null,null,"Origine du combustible",null,null,null,"granulés"]
[null,null,null,null,null,null,null,null,null,null,null,null,null,null,null,null,"Aide ADEME - Fonds chaleur après plafonnement CEE",null,{"$f":"IF(R107+R117>0.65*(S76+S80+S93),IF(0.65*(S76+S80+S93)-R117<0,0,0.65*(S76+S80+S93)-R117),R107)","v":0},null,null,null,"tep EnR consommées",null,null,null,{"$f":"C106/11.63","v":0}]
[null,"rendement production bois",0.82,"pertes réseaux et sous-stations",null,{"$f":"IF(G109=\"isolation standard\",ROUND(L166*220*24/1000,0), IF(G109=\"isolation +\",ROUND(N166*220*24/1000,0), ROUND(O166*220*24/1000,0)))","v":0},"isolation ++",null,null,null,null,null,null,null,null,null,"autre aide (FEDER, DSIL ...)",null,0,null,null,null,"tep substituées",null,null,null,{"$f":"(G64-C107)/11.63","v":0}]
[null,"rendement production appoint",0.9,"rendement réseau et sous-stations",null,{"$f":"IF(F109=0,1,(F102)/(F102+F109))","v":1},null,null,null,null,null,null,null,null,null,null,"autre aide (FEDER, DSIL ...)",null,0,null,null,null,"investissement par tep substituée (€)",null,null,null,{"$f":"IF(AA109=0,0,S89/AA109)","v":0}]
[null,null,null,null,null,null,null,null,null,null,null,null,null,null,null,null,"2-Aide réseau de chaleur",null,{"$f":"SUM(S112:S114)","v":0},null,null,null,"tonnes de CO2 évitées/an",null,null,null,{"$f":"SUMIF(D39:G63,\"électricité\",G39:G63)*0.181+SUMIF(D39:G63,\"fioul\",G39:G63)*0.266+SUMIF(D39:G63,\"gaz naturel\",G39:G63)*0.187+SUMIF(D39:G63,\"propane\",G39:G63)*0.232","v":0}]
[null,"5/ COUPLAGE AVEC UNE AUTRE ENR",null,null,null,null,null,null,null,null,null,null,null,null,null,null,"Aide ADEME - Fonds chaleur",null,{"$f":"IF(AA114<1,0,MIN(S87,390*D183+450*D180+610*D177+770*D174+1190*D169))","v":0},null,null,null,"aide par tep substituée sortie chaudière",null,null,null,{"$f":"IF(AA109=0,0,S116/AA109)","v":0}]
[null,null,null,null,null,null,null,null,null,null,null,null,null,null,null,null,"autre aide (à préciser)",null,0,null,null,null,"emploi généré en équivalent temps plein",null,null,null,{"$f":"IF(AND(C99<1000,AA107=\"plaquettes bocagères\"),AA109*(11+1.8)/1000,IF(AND(C99<1000,AA107=\"plaquettes forestières\"),AA109*(1.8+6.4)/1000,IF(AND(C99<1000,AA107=\"plaquettes bois de fin de vie\"),AA109*(1.8+7.7)/1000,IF(AND(C99<1000,AA107=\"granulés\"),AA109*(1.8+1)/1000,IF(C99>1000,AA109*(1.1+6.4)/1000, )))))","v":0}]
[null,"Couplage avec du solaire thermique ?","Non",null,"Couplage avec du géothermie ?","Non",null,null,null,null,null,null,null,null,null,null,"autre aide (à préciser)",null,0,null,null,null,"chaleur livrée par ml de réseau (MWh)",null,null,null,{"$f":"IF(OR(R84=0,R84=\"\"),\"\",F102/R84)","v":""}]
[null,"Coût de l'investissement sans subvention (€)",null,null,"Coût de l'investissement subvention déduite (€)",null,null,null,null,null,null,null,null,null,null,null,"3-Bonus Citoyen Fond Chaleur",null,{"$f":"IF(S101=\"Projet à gouvernance citoyenne\",10%*(S108+S112),0)","v":0},null,null,null,"temps fonctionnement pleine puissance (heures)",null,null,null,{"$f":"IF(C99=0,0,C106*C109/C99*1000)","v":0}]
[null,"Montant de subvention (€)",null,null,"Coût de l'investissement subvention déduite (€)",null,null,null,null,null,null,null,null,null,null,null,"1 + 2 + 3 =Aides publiques totales",null,{"$f":"S111+S106+S115","v":0},{"$f":"IF(OR(Q101=\"chaufferie bois dédiée \",Q101=\"réseau technique\", Q101=\"réseau avec vente à 1 sous-station\"),IF(R100=\"grande entreprise\",MIN(S116,0.45*S96),IF(R100=\"moyenne entreprise\",MIN(S116,0.55*S96),IF(R100=\"petite entreprise\",MIN(S116,0.65*S96),IF(AND(R100=\"collectivité\",S100=\"activité économique\"),MIN(S116,0.65*S96),MIN(S116,0.8*S96))))),IF(Q101=\"réseau de chaleur avec vente avec > 2 sous stations\",MAX(T120,(IF(R101=\"<100%EnR\",IF(R100=\"grande entreprise\",MIN(S116,0.3*S96),IF(R100=\"moyenne entreprise\",MIN(S116,0.4*S96),MIN(S116,0.5*S96))),IF(R100=\"grande entreprise\",MIN(S116,(0.3+0.15)*S96),IF(R100=\"moyenne entreprise\",MIN(S116,(0.4+0.15)*S96),MIN(S116,(0.5+0.15)*S96))))))))","v":0},{"$f":"IF(S96=0,0,T116/(S96))","v":0},null,"CO2 en équivalents tours de la Terre en voiture",null,null,null,{"$f":"AA111*1000/0.16/40075","v":0}]
[null,"Coût de l'investissement subvention déduite (€)",{"$f":"IF(AND(C114=\"Oui\",$Q$101=\"réseau de chaleur avec vente avec > 2 sous stations\"),MIN($S$96/(T116+C116),0.65*$S$96),(C115-C116))","v":0},null,"Coût de l'investissement subvention déduite (€)",{"$f":"IF(AND(F114=\"Oui\",$Q$101=\"réseau de chaleur avec vente avec > 2 sous stations\"),MIN($S$96/(W115+F116),0.65*$S$96),(F115-F116))","v":0},null,null,null,null,null,null,null,null,null,null,"CEE changement chaudière :",{"$f":"IF(Q101=\"réseau de chaleur avec vente avec > 2 sous stations\",0,\nIF(U100=\"Tertiaire\",IF(C99<=500,4.8*F103,3.4*F103),IF(C99<=500,4.8*F103,3.4*F103)))*Y88","v":0},null,{"$f":"R117","v":0},null,null,"économie de fonctionnement supplémentaires injectée dans le territoire",null,null,null,{"$f":"AB71+0.2*AB72+0.9*AB76-0.2*T63-0.9*U63","v":0}]
[null,"Production EnR (MWh)",null,null,"Production EnR (MWh)",null,null,null,null,null,null,null,null,null,null,null,"CEE  raccordement RC /Nb de logements raccordés si résidentiel :",{"$f":"IF(OR(R117<>0,Q101<>\"réseau de chaleur avec vente avec > 2 sous stations\"),0,_xlfn.IFS(U100=\"Résidentiel individuel\",40.2*_xlfn.IFS(SUM($E$9:$E$33)<70,0.5,SUM($E$9:$E$33)<90,0.7,SUM($E$9:$E$33)<110,1,SUM($E$9:$E$33)<=130,1.1,SUM($E$9:$E$33)>130,1.6)*$Y$88,U100=\"Résidentiel collectif\",(SUMIF(C9:C33,\"<=125\")*24+COUNTIF(C9:C33,\"<=125\")*9000+(SUMIF(C9:C33,\">125\")*54+COUNTIF(C9:C33,\">125\")*5200))*$Y$88,U100=\"Tertiaire\",IF(U101=\"Chauffage seul \",SUMPRODUCT($D$196:$D$207,$E$196:$E$207)*0.9*$Y$88/1000+SUMPRODUCT($J$196:$J$207,$K$196:$K$207)*0.9*$Y$88/1000,SUMPRODUCT($D$196:$D$207,$F$196:$F$207)*0.9*$Y$88/1000)+SUMPRODUCT($J$196:$J$207,$L$196:$L$207)*0.9*$Y$88/1000))\n\n+ IF(AND(Q101=\"réseau de chaleur avec vente avec > 2 sous stations\",F102<>0),(SUMPRODUCT(P9:P33,E9:E33)*0.2+9500*SUM(P9:P33))*$Y$88+(SUMIF(E9:E33,\">7500\")*0.8+5000*COUNTIF(E9:E33,\">7500\"))*$Y$88\n+(SUMPRODUCT(Q9:Q33,C9:C33)*24+9000*SUM(Q9:Q33))*$Y$88+(SUMIF(C9:C33,\">125\")*54+5200*COUNTIF(E9:E33,\">125\"))*$Y$88,0)","v":0},null,{"$f":"R118","v":0}]
[null,"P2 (€)",null,null,"P1 (€)",null,null,null,null,null,null,null,null,null,null,null,"1  + 2 + 3 + CEE = Aides totales",null,{"$f":"S116+R117+R118","v":0},{"$f":"T116+T117+T118","v":0},{"$f":"IF(S96=0,0,IF(T119/(S96)>1,1,T119/(S96)))","v":0}]
[null,"P3 (€)",null,null,"P2 (€)",null,null,null,null,null,null,null,null,null,null,null,"Valeur à reporter à partir de la cellule A48 renseignée dans l'onglet \"déficit de financement\" :"]
[null,null,null,null,"P3 (€)"]
[]
[null,"6/ DIMENSIONNEMENT DIAMETRES RESEAU DE CHALEUR",null,null,null,null,null,null,null,null,null,null,null,null,null,null,"14/ COUT DU MWh"]
[null,null,null,null,null,null,null,null,"Réseau préisolé enterré 90/70 °C"]
[null,"tronçon","Longueur de tranchée (m)","Longueur canalisation A/R (m)","Puissance à livrer (KW)","DT °C","Débit m3/h","DN \n","Pertes W/ml\nisolation standard\nA+R","Pertes W/ml\nisolation +\nA+R","Pertes W/ml\nisolation ++\nA+R","Pertes kW\nisolation standard\nA+R",null,"Pertes kW\nisolation +\nA+R","Pertes kW\nisolation ++\nA+R",null,"Coût du MWh utile en année 1"]
[null,null,null,{"$f":"(C126*2)","v":0},null,20,{"$f":"(E126/(1.163*F126))","v":0},{"$f":"IF($G126=0,\"\",VLOOKUP($G126,$H$170:$N$177,3,TRUE))","v":""},{"$f":"IF($G126=0,\"\",VLOOKUP($G126,$H$170:$N$177,4,TRUE))","v":""},{"$f":"IF($G126=0,\"\",VLOOKUP($G126,$H$170:$N$177,5,TRUE))","v":""},{"$f":"IF($G126=0,\"\",VLOOKUP($G126,$H$170:$N$177,7,TRUE))","v":""},{"$f":"IF($C126=\"\",\"\",I126*$C126/1000)","v":""},null,{"$f":"IF($C126=\"\",\"\",J126*$C126/1000)","v":""},{"$f":"IF($C126=\"\",\"\",K126*$C126/1000)","v":""}]
[null,null,null,{"$f":"(C127*2)","v":0},null,20,{"$f":"(E127/(1.163*F127))","v":0},"","","",{"$f":"IF($G127=0,\"\",VLOOKUP($G127,$H$170:$N$177,7,TRUE))","v":""},"",null,"","",null,null,"coût du MWh utile",null,"dépenses totales"]
[null,null,null,{"$f":"(C128*2)","v":0},null,20,0,"","","","",{"$f":"IF($C128=\"\",\"\",I128*$C128/1000)","v":""},null,"","",null,null,"bois","référence","bois","référence"]
[null,null,null,0,null,20,0,"","","","","",null,"","",null,"P1 - énergie bois",{"$f":"IF($F$102=0,0,T129/$F$102)","v":0},{"$f":"IF($J$64=0,0,U129/$J$64)","v":0},{"$f":"AB71","v":0}]
[null,null,null,0,null,20,0,"","","","","",null,"","",null,{"$f":"\"P1 - énergie appoint/ref\" &IF(F114=\"Oui\",\"dont P1 géothermie\",\"\")","v":"P1 - énergie appoint/ref"},{"$f":"IF($F$102=0,0,T130/$F$102)","v":0},{"$f":"IF($J$64=0,0,U130/$J$64)","v":0},{"$f":"AB72","v":0},{"$f":"T63","v":0}]
[null,null,null,0,null,20,0,"","","","","",null,"","",null,{"$f":"\"P2 - maintenance\"&IF(C114=\"Oui\",\"+ P2 ST\",\"\")&IF(F114=\"Oui\",\"+ P2 GEO\",\"\")","v":"P2 - maintenance"},{"$f":"IF($F$102=0,0,T131/$F$102)","v":0},{"$f":"IF($J$64=0,0,U131/$J$64)","v":0},{"$f":"AB73","v":0},{"$f":"U63","v":0}]
[null,null,null,0,null,20,0,"","","","","",null,"","",null,{"$f":"\"P3 - gros entretien\"&IF(C114=\"Oui\",\"+ P3 ST\",\"\")&IF(F114=\"Oui\",\"+ P3 GEO\",\"\")","v":"P3 - gros entretien"},{"$f":"IF($F$102=0,0,T132/$F$102)","v":0},{"$f":"IF($J$64=0,0,U132/$J$64)","v":0},{"$f":"AB78","v":0},{"$f":"V63","v":0}]
[null,null,null,0,null,20,0,"","","","","",null,"","",null,{"$f":"\"P4 - amortissements\"&IF(C114=\"Oui\",\"+ P4 ST\",\"\")&IF(F114=\"Oui\",\"+ P4 GEO\",\"\")","v":"P4 - amortissements"},{"$f":"IF($F$102=0,0,T133/$F$102)","v":0},{"$f":"IF($J$64=0,0,U133/$J$64)","v":0},{"$f":"AB81","v":{"$error":"#NUM!"}},{"$f":"W63","v":0}]
[null,null,null,0,null,20,0,"","","","","",null,"","",null,"TOTAL",{"$f":"SUM(R129:R133)","v":0},{"$f":"SUM(S129:S133)","v":0},{"$f":"SUM(T129:T133)","v":{"$error":"#NUM!"}},{"$f":"SUM(U129:U133)","v":0}]
[null,null,null,0,null,20,0,"","","","","",null,"","",null,{"$f":"IF(W7=\"oui\",IF(W8=\"oui\",\"\",\"TVA (si vente chaleur)\"),\"\")","v":""},{"$f":"IF(W7=\"oui\",IF(W8=\"oui\",\"\",0.055*R214),\"\")","v":""},{"$f":"IF(W7=\"oui\",IF(W8=\"oui\",\"\",0.2*S214),\"\")","v":""}]
[null,null,null,0,null,20,0,"","","","","",null,"","",null,{"$f":"IF(W7=\"oui\",IF(W8=\"oui\",\"\",\"TOTAL TTC\"),\"\")","v":""},{"$f":"IF(W7=\"oui\",IF(W8=\"oui\",\"\",R214+R215),\"\")","v":""},{"$f":"IF(W7=\"oui\",IF(W8=\"oui\",\"\",S214+S215),\"\")","v":""}]
[null,null,null,0,null,20,0,"","","","","",null,"",""]
[null,null,null,0,null,20,0,"","","","","",null,"","",null,"1ère approche de Tarification de la chaleur (si vente)"]
[null,null,null,0,null,20,0,"","","","","",null,"",""]
[null,null,null,0,null,20,0,"","","","","",null,"","",null,"MWh livrés",null,null,{"$f":"F102","v":0}]
[null,null,null,0,null,20,0,"","","","","",null,"","",null,"Puissance totale raccordées",null,null,{"$f":"C98","v":0}]
[null,null,null,0,null,20,0,"","","","","",null,"","",null,"coût unitaire R1 par MWh utile",null,null,{"$f":"IF(OR(T140=0,AB70=0),0,AB70/T140)","v":0}]
[null,null,null,0,null,20,0,"","","","","",null,"","",null,"coût unitaire R2 par kW",null,null,{"$f":"IF(OR(T141=0,T140=0),0,(AB73+AB78+AB81)/T141)","v":0}]
[null,null,null,0,null,20,0,"","","","","",null,"",""]
[null,null,null,0,null,20,0,"","","","","",null,"",""]
[null,null,null,0,null,20,0,"","","","","",null,"","",null,"PREMIERE APPROCHE DU COUT DU MWH PAR ABONNES (si vente de chaleur)"]
[null,null,null,0,null,20,0,"","","","","",null,"","",null,null,"scénario bois",null,null,null,null,null,null,"scénario référence",null,null,null,null,null,null,null,null,"delta TTC"]
[null,null,null,0,null,20,0,"","","","","",null,"","",null,null,"R1 bois","R2 bois","R1+R2","TVA (si vente de chaleur)","R1 + R2 TTC","€/MWh HT","€/MWh TTC","P1 référence","P2 référence","P3 référence","P4 référence","cout annuel HT","TVA","cout annuel TTC","€/Mwh HT","€/Mwh TTC"]
[null,null,null,0,null,20,0,"","","","","",null,"","",null,{"$f":"IF(D9=0,\"\",D9)","v":" "},{"$f":"$T$142*E70","v":0},{"$f":"$T$143*D70","v":0},{"$f":"R149+S149","v":0},{"$f":"IF($W$7=\"oui\",T149*(5.5%),T149*(20%))","v":0},{"$f":"T149+U149","v":0},{"$f":"IF(E70=0,0,T149/(E70))","v":0},{"$f":"IF(E70=0,0,V149/(E70))","v":0},{"$f":"IF(OR(F39=\"\",G39=\"\"),0,G39*(1+_xlfn.IFS(OR(D39=\"PAC\",D39=\"électricité\"),$Y$91,OR(D39=\"granulé\",D39=\"bois déchiqueté\"),$Y$90,OR(D39=\"fioul\",D39=\"gaz naturel\",D39=\"propane\"),$Y$92))*VLOOKUP(D39,$Y$7:$Z$12,2))","v":0},{"$f":"IF(F39=\"\",0,IF(AND(F39>1,F39<8.99),250,IF(AND(F39>9,F39<96),0.18*F39^2-7.6*F39+300,IF(AND(F39>95,F39<951),6.6*F39+530,IF(AND(F39>950,F39<3501),F39+5800,IF(F39>3500,3.2*F39-1900,\"\"))))))*1.3","v":0},{"$f":"0.01*IF(F39=0,0,IF($C39=\"\",\"définir le type de travaux envisagé pour ce batiment\",IF($F39=0,0,O9*IF(AND($F39>9,$F39<151),0.57*$F39^2+76*$F39+2500,IF(AND($F39>150,$F39<951),56.1*$F39+18300,IF(AND($F39>950,$F39<14501),34.3*$F39+39000,IF($F39>14500,20.3*$F39+242000,\"\")))))))*1.3","v":0},{"$f":"IF(X38=\"\",-PMT($AA$83,$Z$83,IF(F39=0,0,IF($C39=\"\",\"définir le type de travaux envisagé pour ce batiment\",IF($F39=0,0,O9*IF(AND($F39>9,$F39<151),0.57*$F39^2+76*$F39+2500,IF(AND($F39>150,$F39<951),56.1*$F39+18300,IF(AND($F39>950,$F39<14501),34.3*$F39+39000,IF($F39>14500,20.3*$F39+242000,\"\")))))))*1.3),-PMT($AA$83,X38,IF(F39=0,0,IF($C39=\"\",\"définir le type de travaux envisagé pour ce batiment\",IF($F39=0,0,O9*IF(AND($F39>9,$F39<151),0.57*$F39^2+76*$F39+2500,IF(AND($F39>150,$F39<951),56.1*$F39+18300,IF(AND($F39>950,$F39<14501),34.3*$F39+39000,IF($F39>14500,20.3*$F39+242000,\"\")))))))*1.3))","v":{"$error":"#NUM!"}},{"$f":"SUM(Y149:AB149)","v":{"$error":"#NUM!"}},{"$f":"AC149*W9","v":{"$error":"#NUM!"}},{"$f":"AD149+AC149","v":{"$error":"#NUM!"}},{"$f":"IF(J39=0,0,AC149/(J39))","v":{"$error":"#NUM!"}},{"$f":"IF(J39=0,0,AE149/(J39))","v":{"$error":"#NUM!"}},{"$f":"IF(AE149=0,0,(V149-AE149)/AE149)","v":{"$error":"#NUM!"}}]
[null,null,null,0,null,20,0,"","","","","",null,"","",null," ",0,0,{"$f":"R150+S150","v":0},{"$f":"IF($W$7=\"oui\",T150*(5.5%),T150*(20%))","v":0},{"$f":"T150+U150","v":0},0,0,{"$f":"IF(OR(F40=\"\",G40=\"\"),0,G40*(1+_xlfn.IFS(OR(D40=\"PAC\",D40=\"électricité\"),$Y$91,OR(D40=\"granulé\",D40=\"bois déchiqueté\"),$Y$90,OR(D40=\"fioul\",D40=\"gaz naturel\",D40=\"propane\"),$Y$92))*VLOOKUP(D40,$Y$7:$Z$12,2))","v":0},0,0,{"$error":"#NUM!"},{"$f":"SUM(Y150:AB150)","v":{"$error":"#NUM!"}},{"$error":"#NUM!"},{"$f":"AD150+AC150","v":{"$error":"#NUM!"}},{"$error":"#NUM!"},{"$error":"#NUM!"},{"$f":"IF(AE150=0,0,(V150-AE150)/AE150)","v":{"$error":"#NUM!"}}]
[null,null,null,{"$f":"(C151*2)","v":0},null,20,{"$f":"(E151/(1.163*F151))","v":0},"","","","","",null,"","",null," ",0,0,0,0,0,0,0,{"$f":"IF(OR(F41=\"\",G41=\"\"),0,G41*(1+_xlfn.IFS(OR(D41=\"PAC\",D41=\"électricité\"),$Y$91,OR(D41=\"granulé\",D41=\"bois déchiqueté\"),$Y$90,OR(D41=\"fioul\",D41=\"gaz naturel\",D41=\"propane\"),$Y$92))*VLOOKUP(D41,$Y$7:$Z$12,2))","v":0},0,0,{"$error":"#NUM!"},{"$error":"#NUM!"},{"$error":"#NUM!"},{"$error":"#NUM!"},{"$error":"#NUM!"},{"$error":"#NUM!"},{"$error":"#NUM!"}]
[null,null,null,0,null,20,0,"","","","","",null,"","",null," ",0,0,0,0,0,0,0,{"$f":"IF(OR(F42=\"\",G42=\"\"),0,G42*(1+_xlfn.IFS(OR(D42=\"PAC\",D42=\"électricité\"),$Y$91,OR(D42=\"granulé\",D42=\"bois déchiqueté\"),$Y$90,OR(D42=\"fioul\",D42=\"gaz naturel\",D42=\"propane\"),$Y$92))*VLOOKUP(D42,$Y$7:$Z$12,2))","v":0},0,0,{"$error":"#NUM!"},{"$error":"#NUM!"},{"$error":"#NUM!"},{"$error":"#NUM!"},{"$error":"#NUM!"},{"$error":"#NUM!"},{"$error":"#NUM!"}]
[null,null,null,0,null,20,0,"","","","","",null,"","",null," ",0,0,0,0,0,0,0,{"$f":"IF(OR(F43=\"\",G43=\"\"),0,G43*(1+_xlfn.IFS(OR(D43=\"PAC\",D43=\"électricité\"),$Y$91,OR(D43=\"granulé\",D43=\"bois déchiqueté\"),$Y$90,OR(D43=\"fioul\",D43=\"gaz naturel\",D43=\"propane\"),$Y$92))*VLOOKUP(D43,$Y$7:$Z$12,2))","v":0},0,0,{"$error":"#NUM!"},{"$error":"#NUM!"},{"$error":"#NUM!"},{"$error":"#NUM!"},{"$error":"#NUM!"},{"$error":"#NUM!"},{"$error":"#NUM!"}]
[null,null,null,0,null,20,0,"","","","","",null,"","",null," ",0,0,0,0,0,0,0,{"$f":"IF(OR(F44=\"\",G44=\"\"),0,G44*(1+_xlfn.IFS(OR(D44=\"PAC\",D44=\"électricité\"),$Y$91,OR(D44=\"granulé\",D44=\"bois déchiqueté\"),$Y$90,OR(D44=\"fioul\",D44=\"gaz naturel\",D44=\"propane\"),$Y$92))*VLOOKUP(D44,$Y$7:$Z$12,2))","v":0},0,0,{"$error":"#NUM!"},{"$error":"#NUM!"},{"$error":"#NUM!"},{"$error":"#NUM!"},{"$error":"#NUM!"},{"$error":"#NUM!"},{"$error":"#NUM!"}]
[null,null,null,0,null,20,0,"","","","","",null,"","",null," ",0,0,0,0,0,0,0,{"$f":"IF(OR(F45=\"\",G45=\"\"),0,G45*(1+_xlfn.IFS(OR(D45=\"PAC\",D45=\"électricité\"),$Y$91,OR(D45=\"granulé\",D45=\"bois déchiqueté\"),$Y$90,OR(D45=\"fioul\",D45=\"gaz naturel\",D45=\"propane\"),$Y$92))*VLOOKUP(D45,$Y$7:$Z$12,2))","v":0},0,0,{"$error":"#NUM!"},{"$error":"#NUM!"},{"$error":"#NUM!"},{"$error":"#NUM!"},{"$error":"#NUM!"},{"$error":"#NUM!"},{"$error":"#NUM!"}]
[null,null,null,0,null,20,0,"","","","","",null,"","",null," ",0,0,0,0,0,0,0,{"$f":"IF(OR(F46=\"\",G46=\"\"),0,G46*(1+_xlfn.IFS(OR(D46=\"PAC\",D46=\"électricité\"),$Y$91,OR(D46=\"granulé\",D46=\"bois déchiqueté\"),$Y$90,OR(D46=\"fioul\",D46=\"gaz naturel\",D46=\"propane\"),$Y$92))*VLOOKUP(D46,$Y$7:$Z$12,2))","v":0},0,0,{"$error":"#NUM!"},{"$error":"#NUM!"},{"$error":"#NUM!"},{"$error":"#NUM!"},{"$error":"#NUM!"},{"$error":"#NUM!"},{"$error":"#NUM!"}]
[null,null,null,0,null,20,0,"","","","","",null,"","",null," ",0,0,0,0,0,0,0,{"$f":"IF(OR(F47=\"\",G47=\"\"),0,G47*(1+_xlfn.IFS(OR(D47=\"PAC\",D47=\"électricité\"),$Y$91,OR(D47=\"granulé\",D47=\"bois déchiqueté\"),$Y$90,OR(D47=\"fioul\",D47=\"gaz naturel\",D47=\"propane\"),$Y$92))*VLOOKUP(D47,$Y$7:$Z$12,2))","v":0},0,0,{"$error":"#NUM!"},{"$error":"#NUM!"},{"$error":"#NUM!"},{"$error":"#NUM!"},{"$error":"#NUM!"},{"$error":"#NUM!"},{"$error":"#NUM!"}]
[null,null,null,0,null,20,0,"","","","","",null,"","",null," ",0,0,0,0,0,0,0,{"$f":"IF(OR(F48=\"\",G48=\"\"),0,G48*(1+_xlfn.IFS(OR(D48=\"PAC\",D48=\"électricité\"),$Y$91,OR(D48=\"granulé\",D48=\"bois déchiqueté\"),$Y$90,OR(D48=\"fioul\",D48=\"gaz naturel\",D48=\"propane\"),$Y$92))*VLOOKUP(D48,$Y$7:$Z$12,2))","v":0},0,0,{"$error":"#NUM!"},{"$error":"#NUM!"},{"$error":"#NUM!"},{"$error":"#NUM!"},{"$error":"#NUM!"},{"$error":"#NUM!"},{"$error":"#NUM!"}]
[null,null,null,{"$f":"(C159*2)","v":0},null,20,{"$f":"(E159/(1.163*F159))","v":0},"","","","","",null,"","",null," ",0,0,0,0,0,0,0,{"$f":"IF(OR(F49=\"\",G49=\"\"),0,G49*(1+_xlfn.IFS(OR(D49=\"PAC\",D49=\"électricité\"),$Y$91,OR(D49=\"granulé\",D49=\"bois déchiqueté\"),$Y$90,OR(D49=\"fioul\",D49=\"gaz naturel\",D49=\"propane\"),$Y$92))*VLOOKUP(D49,$Y$7:$Z$12,2))","v":0},0,0,{"$error":"#NUM!"},{"$error":"#NUM!"},{"$error":"#NUM!"},{"$error":"#NUM!"},{"$error":"#NUM!"},{"$error":"#NUM!"},{"$error":"#NUM!"}]
[null,null,null,0,null,20,0,"","","","","",null,"","",null," ",0,0,0,0,0,0,0,{"$f":"IF(OR(F50=\"\",G50=\"\"),0,G50*(1+_xlfn.IFS(OR(D50=\"PAC\",D50=\"électricité\"),$Y$91,OR(D50=\"granulé\",D50=\"bois déchiqueté\"),$Y$90,OR(D50=\"fioul\",D50=\"gaz naturel\",D50=\"propane\"),$Y$92))*VLOOKUP(D50,$Y$7:$Z$12,2))","v":0},0,0,{"$error":"#NUM!"},{"$error":"#NUM!"},{"$error":"#NUM!"},{"$error":"#NUM!"},{"$error":"#NUM!"},{"$error":"#NUM!"},{"$error":"#NUM!"}]
[null,null,null,0,null,20,0,"","","","","",null,"","",null," ",0,0,0,0,0,0,0,{"$f":"IF(OR(F51=\"\",G51=\"\"),0,G51*(1+_xlfn.IFS(OR(D51=\"PAC\",D51=\"électricité\"),$Y$91,OR(D51=\"granulé\",D51=\"bois déchiqueté\"),$Y$90,OR(D51=\"fioul\",D51=\"gaz naturel\",D51=\"propane\"),$Y$92))*VLOOKUP(D51,$Y$7:$Z$12,2))","v":0},0,0,{"$error":"#NUM!"},{"$error":"#NUM!"},{"$error":"#NUM!"},{"$error":"#NUM!"},{"$error":"#NUM!"},{"$error":"#NUM!"},{"$error":"#NUM!"}]
[null,null,null,0,null,20,0,"","","","","",null,"","",null," ",0,0,0,0,0,0,0,{"$f":"IF(OR(F52=\"\",G52=\"\"),0,G52*(1+_xlfn.IFS(OR(D52=\"PAC\",D52=\"électricité\"),$Y$91,OR(D52=\"granulé\",D52=\"bois déchiqueté\"),$Y$90,OR(D52=\"fioul\",D52=\"gaz naturel\",D52=\"propane\"),$Y$92))*VLOOKUP(D52,$Y$7:$Z$12,2))","v":0},0,0,{"$error":"#NUM!"},{"$error":"#NUM!"},{"$error":"#NUM!"},{"$error":"#NUM!"},{"$error":"#NUM!"},{"$error":"#NUM!"},{"$error":"#NUM!"}]
[null,null,null,0,null,20,0,"","","","","",null,"","",null," ",0,0,0,0,0,0,0,{"$f":"IF(OR(F53=\"\",G53=\"\"),0,G53*(1+_xlfn.IFS(OR(D53=\"PAC\",D53=\"électricité\"),$Y$91,OR(D53=\"granulé\",D53=\"bois déchiqueté\"),$Y$90,OR(D53=\"fioul\",D53=\"gaz naturel\",D53=\"propane\"),$Y$92))*VLOOKUP(D53,$Y$7:$Z$12,2))","v":0},0,0,{"$error":"#NUM!"},{"$error":"#NUM!"},{"$error":"#NUM!"},{"$error":"#NUM!"},{"$error":"#NUM!"},{"$error":"#NUM!"},{"$error":"#NUM!"}]
[null,null,null,0,null,20,0,"","","","","",null,"","",null," ",0,0,0,0,0,0,0,{"$f":"IF(OR(F54=\"\",G54=\"\"),0,G54*(1+_xlfn.IFS(OR(D54=\"PAC\",D54=\"électricité\"),$Y$91,OR(D54=\"granulé\",D54=\"bois déchiqueté\"),$Y$90,OR(D54=\"fioul\",D54=\"gaz naturel\",D54=\"propane\"),$Y$92))*VLOOKUP(D54,$Y$7:$Z$12,2))","v":0},0,0,{"$error":"#NUM!"},{"$error":"#NUM!"},{"$error":"#NUM!"},{"$error":"#NUM!"},{"$error":"#NUM!"},{"$error":"#NUM!"},{"$error":"#NUM!"}]
[null,null,null,0,null,20,0,"","","","","",null,"","",null," ",0,0,0,0,0,0,0,{"$f":"IF(OR(F55=\"\",G55=\"\"),0,G55*(1+_xlfn.IFS(OR(D55=\"PAC\",D55=\"électricité\"),$Y$91,OR(D55=\"granulé\",D55=\"bois déchiqueté\"),$Y$90,OR(D55=\"fioul\",D55=\"gaz naturel\",D55=\"propane\"),$Y$92))*VLOOKUP(D55,$Y$7:$Z$12,2))","v":0},0,0,{"$error":"#NUM!"},{"$error":"#NUM!"},{"$error":"#NUM!"},{"$error":"#NUM!"},{"$error":"#NUM!"},{"$error":"#NUM!"},{"$error":"#NUM!"}]
[null,"Total",{"$f":"SUM(C126:C165)","v":0},"densité thermique du réseau :",null,{"$f":"IF(C166=0,\"\",$F$102/C166)","v":""},null,null,null,null,null,{"$f":"SUM(L126:L165)","v":0},null,{"$f":"SUM(N126:N165)","v":0},{"$f":"SUM(O126:O165)","v":0},null," ",0,0,0,0,0,0,0,{"$f":"IF(OR(F56=\"\",G56=\"\"),0,G56*(1+_xlfn.IFS(OR(D56=\"PAC\",D56=\"électricité\"),$Y$91,OR(D56=\"granulé\",D56=\"bois déchiqueté\"),$Y$90,OR(D56=\"fioul\",D56=\"gaz naturel\",D56=\"propane\"),$Y$92))*VLOOKUP(D56,$Y$7:$Z$12,2))","v":0},0,0,{"$error":"#NUM!"},{"$error":"#NUM!"},{"$error":"#NUM!"},{"$error":"#NUM!"},{"$error":"#NUM!"},{"$error":"#NUM!"},{"$error":"#NUM!"}]
[null,null,null,null,null,null,null,null,null,null,null,null,null,null,null,null," ",0,0,0,0,0,0,0,{"$f":"IF(OR(F57=\"\",G57=\"\"),0,G57*(1+_xlfn.IFS(OR(D57=\"PAC\",D57=\"électricité\"),$Y$91,OR(D57=\"granulé\",D57=\"bois déchiqueté\"),$Y$90,OR(D57=\"fioul\",D57=\"gaz naturel\",D57=\"propane\"),$Y$92))*VLOOKUP(D57,$Y$7:$Z$12,2))","v":0},0,0,{"$error":"#NUM!"},{"$error":"#NUM!"},{"$error":"#NUM!"},{"$error":"#NUM!"},{"$error":"#NUM!"},{"$error":"#NUM!"},{"$error":"#NUM!"}]
[null,"DN","Longueur de tranchée (ml)","Total métrés par tranche","ratio investissement","investissement",null,"Source INPAL",null,null,null,null,null,null,null,null," ",0,0,0,0,0,0,0,{"$f":"IF(OR(F58=\"\",G58=\"\"),0,G58*(1+_xlfn.IFS(OR(D58=\"PAC\",D58=\"électricité\"),$Y$91,OR(D58=\"granulé\",D58=\"bois déchiqueté\"),$Y$90,OR(D58=\"fioul\",D58=\"gaz naturel\",D58=\"propane\"),$Y$92))*VLOOKUP(D58,$Y$7:$Z$12,2))","v":0},0,0,{"$error":"#NUM!"},{"$error":"#NUM!"},{"$error":"#NUM!"},{"$error":"#NUM!"},{"$error":"#NUM!"},{"$error":"#NUM!"},{"$error":"#NUM!"}]
[null,"DN650",{"$f":"SUMPRODUCT(($H$126:$H$165=$B169)*($C$126:$C$165))","v":0},{"$f":"SUM(C169:C173)","v":0},1800,{"$f":"E169*C169","v":0},null,"débit mini (m3/h)","débit maxi m3/h","DN","Pertes W/ml\nIso standart\n(source INPAL)","Pertes W/ml - iso +\n(source INPAL)",null,"Pertes W/ml- iso ++\n(source INPAL)",null,null," ",0,0,0,0,0,0,0,{"$f":"IF(OR(F59=\"\",G59=\"\"),0,G59*(1+_xlfn.IFS(OR(D59=\"PAC\",D59=\"électricité\"),$Y$91,OR(D59=\"granulé\",D59=\"bois déchiqueté\"),$Y$90,OR(D59=\"fioul\",D59=\"gaz naturel\",D59=\"propane\"),$Y$92))*VLOOKUP(D59,$Y$7:$Z$12,2))","v":0},0,0,{"$error":"#NUM!"},{"$error":"#NUM!"},{"$error":"#NUM!"},{"$error":"#NUM!"},{"$error":"#NUM!"},{"$error":"#NUM!"},{"$error":"#NUM!"}]
[null,"DN600",0,null,1700,0,null,0.1,5,"DN40",33,33,null,33,null,null," ",0,0,0,0,0,0,0,{"$f":"IF(OR(F60=\"\",G60=\"\"),0,G60*(1+_xlfn.IFS(OR(D60=\"PAC\",D60=\"électricité\"),$Y$91,OR(D60=\"granulé\",D60=\"bois déchiqueté\"),$Y$90,OR(D60=\"fioul\",D60=\"gaz naturel\",D60=\"propane\"),$Y$92))*VLOOKUP(D60,$Y$7:$Z$12,2))","v":0},0,0,{"$error":"#NUM!"},{"$error":"#NUM!"},{"$error":"#NUM!"},{"$error":"#NUM!"},{"$error":"#NUM!"},{"$error":"#NUM!"},{"$error":"#NUM!"}]
[null,"DN550",0,null,1600,0,null,6,10,"DN65",34.17,28.65,null,25.1,null,null," ",0,0,0,0,0,0,0,{"$f":"IF(OR(F61=\"\",G61=\"\"),0,G61*(1+_xlfn.IFS(OR(D61=\"PAC\",D61=\"électricité\"),$Y$91,OR(D61=\"granulé\",D61=\"bois déchiqueté\"),$Y$90,OR(D61=\"fioul\",D61=\"gaz naturel\",D61=\"propane\"),$Y$92))*VLOOKUP(D61,$Y$7:$Z$12,2))","v":0},0,0,{"$error":"#NUM!"},{"$error":"#NUM!"},{"$error":"#NUM!"},{"$error":"#NUM!"},{"$error":"#NUM!"},{"$error":"#NUM!"},{"$error":"#NUM!"}]
[null,"DN500",0,null,1500,0,null,11,15,"DN80",35.22,30,null,26.57,null,null," ",0,0,0,0,0,0,0,{"$f":"IF(OR(F62=\"\",G62=\"\"),0,G62*(1+_xlfn.IFS(OR(D62=\"PAC\",D62=\"électricité\"),$Y$91,OR(D62=\"granulé\",D62=\"bois déchiqueté\"),$Y$90,OR(D62=\"fioul\",D62=\"gaz naturel\",D62=\"propane\"),$Y$92))*VLOOKUP(D62,$Y$7:$Z$12,2))","v":0},0,0,{"$error":"#NUM!"},{"$error":"#NUM!"},{"$error":"#NUM!"},{"$error":"#NUM!"},{"$error":"#NUM!"},{"$error":"#NUM!"},{"$error":"#NUM!"}]
[null,"DN450",0,null,1400,0,null,16,20,"DN100",36.86,31.31,null,27.56,null,null," ",0,0,0,0,0,0,0,{"$f":"IF(OR(F63=\"\",G63=\"\"),0,G63*(1+_xlfn.IFS(OR(D63=\"PAC\",D63=\"électricité\"),$Y$91,OR(D63=\"granulé\",D63=\"bois déchiqueté\"),$Y$90,OR(D63=\"fioul\",D63=\"gaz naturel\",D63=\"propane\"),$Y$92))*VLOOKUP(D63,$Y$7:$Z$12,2))","v":0},0,0,{"$error":"#NUM!"},{"$error":"#NUM!"},{"$error":"#NUM!"},{"$error":"#NUM!"},{"$error":"#NUM!"},{"$error":"#NUM!"},{"$error":"#NUM!"}]
[null,"DN400",0,{"$f":"SUM(C174:C176)","v":0},1300,0,null,21,50,"DN125",42.49,35.85,null,30.9,null,null,"TOTAL",{"$f":"SUM(R149:R173)","v":0},{"$f":"SUM(S149:S173)","v":0},{"$f":"SUM(T149:T173)","v":0},{"$f":"SUM(U149:U173)","v":0},{"$f":"SUM(V149:V173)","v":0},null,null,{"$f":"SUM(Y149:Y173)","v":0},0,0,{"$error":"#NUM!"},{"$error":"#NUM!"},{"$error":"#NUM!"},{"$error":"#NUM!"}]
[null,"DN350",0,null,1200,0,null,51,80,"DN150",49.57,40.58,null,33.86]
[null,"DN300",0,null,1100,0,null,81,150,"DN200",54.3,43.02,null,35.61]
[null,"DN250",0,{"$f":"SUM(C177:C179)","v":0},1000,0,null,151,400,"DN250",52.98,42.49,null,35.979999999999997]
[null,"DN200",0,null,900,{"$f":"C178*E178","v":0},null,null,null,null,null,null,null,null,null,null,"15/ Evolution des dépenses annuelles"]
[null,"DN150",0,null,800,0,null,null,null,null,null,null,null,null,null,null,null,"dépenses annuelles globales - projet bois",null,null,null,null,null,"dépenses annuelles globales - solution de référence",null,null,null,null,"delta","économies de fonctionnement",null,"dépenses globales cumulées",null,"dépenses de fonctionnement avec inv de départ"]
[null,"DN125",0,{"$f":"SUM(C180:C182)","v":0},700,0,null,null,null,null,null,null,null,null,null,null,null,"P1 bois","P1 appoint","P2+P3","fonctionnement bois","P4","total bois","P1","P2+P3","fonctionnement référence","P4","total référence",null,"par an","économies cumulées","Total cumulé bois","Total cumulé référence","Dépense cumulée bois (inv départ)","Dépense cumulée fossile (inv départ)"]
[null,"DN100",0,null,600,0,null,null,null,null,null,null,null,null,null,null,{"$f":"R8","v":" "},{"$f":"T129","v":0},{"$f":"T130","v":0},{"$f":"T131+T132","v":0},{"$f":"R181+S181+T181","v":0},{"$f":"IF(($Q$181+$Z$82)-Q181>0,$AB$82,0)+IF(($Q$181+$Z$83)-Q181>0,$AB$83,0)","v":{"$error":"#VALUE!"}},{"$f":"R181+T181+S181+V181","v":{"$error":"#VALUE!"}},{"$f":"U130","v":0},{"$f":"U131+U132","v":0},{"$f":"X181+Y181","v":0},{"$f":"IF(MAX($X$38:$X$62)-(Q181-$R$8)>0,$W$63,0)","v":{"$error":"#VALUE!"}},{"$f":"X181+Y181+AA181","v":{"$error":"#VALUE!"}},{"$f":"AB181-W181","v":{"$error":"#VALUE!"}},{"$f":"X181+Y181-R181-S181-T181","v":0},{"$f":"AD181","v":0},{"$f":"W181","v":{"$error":"#VALUE!"}},{"$f":"AB181","v":{"$error":"#VALUE!"}},{"$f":"$U$95+U181","v":0},{"$f":"$R$63+Z181","v":0}]
[null,"DN80",0,null,500,0,null,null,null,null,null,null,null,null,null,null,{"$f":"Q181+1","v":{"$error":"#VALUE!"}},{"$f":"R181*(1+Y$90)","v":0},{"$f":"S181*(1+Y$92)","v":0},{"$f":"IFERROR(T181*(1+($AB$75+$AB$76)/$AB$73*$Y$89+$AB$74/$AB$73*$Y$91),0)","v":0},{"$f":"R182+S182+T182","v":0},{"$error":"#VALUE!"},{"$f":"R182+T182+S182+V182","v":{"$error":"#VALUE!"}},{"$f":"X181*(1+Y$92)","v":0},{"$f":"Y181*(1+Y$89)","v":0},{"$f":"X182+Y182","v":0},{"$error":"#VALUE!"},{"$f":"X182+Y182+AA182","v":{"$error":"#VALUE!"}},{"$error":"#VALUE!"},0,{"$f":"AD182+AE181","v":0},{"$f":"AF181+W182","v":{"$error":"#VALUE!"}},{"$f":"AG181+AB182","v":{"$error":"#VALUE!"}},0,0]
[null,"DN65",0,{"$f":"SUM(C183:C189)","v":0},350,0,null,null,null,null,null,null,null,null,null,null,{"$f":"Q182+1","v":{"$error":"#VALUE!"}},0,0,{"$f":"IFERROR(T182*(1+($AB$75+$AB$76)/$AB$73*$Y$89+$AB$74/$AB$73*$Y$91),0)","v":0},{"$f":"R183+S183+T183","v":0},{"$error":"#VALUE!"},{"$f":"R183+T183+S183+V183","v":{"$error":"#VALUE!"}},0,0,{"$f":"X183+Y183","v":0},{"$error":"#VALUE!"},{"$f":"X183+Y183+AA183","v":{"$error":"#VALUE!"}},{"$error":"#VALUE!"},0,{"$f":"AD183+AE182","v":0},{"$f":"AF182+W183","v":{"$error":"#VALUE!"}},{"$f":"AG182+AB183","v":{"$error":"#VALUE!"}},0,0]
[null,"DN50",0,null,300,0,null,null,null,null,null,null,null,null,null,null,{"$f":"Q183+1","v":{"$error":"#VALUE!"}},0,0,0,0,{"$error":"#VALUE!"},{"$error":"#VALUE!"},0,0,0,{"$error":"#VALUE!"},{"$error":"#VALUE!"},{"$error":"#VALUE!"},0,0,{"$error":"#VALUE!"},{"$error":"#VALUE!"},0,0]
[null,"DN40",0,null,250,0,null,null,null,null,null,null,null,null,null,null,{"$error":"#VALUE!"},0,0,0,0,{"$error":"#VALUE!"},{"$error":"#VALUE!"},0,0,0,{"$error":"#VALUE!"},{"$error":"#VALUE!"},{"$error":"#VALUE!"},0,0,{"$error":"#VALUE!"},{"$error":"#VALUE!"},0,0]
[null,"DN32",0,null,250,0,null,null,null,null,null,null,null,null,null,null,{"$error":"#VALUE!"},0,0,0,0,{"$error":"#VALUE!"},{"$error":"#VALUE!"},0,0,0,{"$error":"#VALUE!"},{"$error":"#VALUE!"},{"$error":"#VALUE!"},0,0,{"$error":"#VALUE!"},{"$error":"#VALUE!"},0,0]
[null,"DN25",0,null,250,0,null,null,null,null,null,null,null,null,null,null,{"$error":"#VALUE!"},0,0,0,0,{"$error":"#VALUE!"},{"$error":"#VALUE!"},0,0,0,{"$error":"#VALUE!"},{"$error":"#VALUE!"},{"$error":"#VALUE!"},0,0,{"$error":"#VALUE!"},{"$error":"#VALUE!"},0,0]
[null,"DN20",0,null,250,0,null,null,null,null,null,null,null,null,null,null,{"$error":"#VALUE!"},0,0,0,0,{"$error":"#VALUE!"},{"$error":"#VALUE!"},0,0,0,{"$error":"#VALUE!"},{"$error":"#VALUE!"},{"$error":"#VALUE!"},0,0,{"$error":"#VALUE!"},{"$error":"#VALUE!"},0,0]
[null,"DN15",0,null,250,0,null,null,null,null,null,null,null,null,null,null,{"$f":"Q188+1","v":{"$error":"#VALUE!"}},0,0,0,0,{"$error":"#VALUE!"},{"$error":"#VALUE!"},0,0,0,{"$error":"#VALUE!"},{"$error":"#VALUE!"},{"$error":"#VALUE!"},0,{"$f":"AD189+AE188","v":0},{"$f":"AF188+W189","v":{"$error":"#VALUE!"}},{"$f":"AG188+AB189","v":{"$error":"#VALUE!"}},0,0]
[null,null,"Total",{"$f":"SUM(D169:D183)","v":0},null,{"$f":"SUM(F169:F189)","v":0},null,null,null,null,null,null,null,null,null,null,{"$f":"Q189+1","v":{"$error":"#VALUE!"}},0,0,0,0,{"$error":"#VALUE!"},{"$error":"#VALUE!"},0,0,0,{"$error":"#VALUE!"},{"$error":"#VALUE!"},{"$error":"#VALUE!"},0,{"$f":"AD190+AE189","v":0},{"$f":"AF189+W190","v":{"$error":"#VALUE!"}},{"$f":"AG189+AB190","v":{"$error":"#VALUE!"}},0,0]
[null,null,null,null,null,null,null,null,null,null,null,null,null,null,null,null,{"$f":"Q190+1","v":{"$error":"#VALUE!"}},0,0,0,0,{"$error":"#VALUE!"},{"$error":"#VALUE!"},0,0,0,{"$error":"#VALUE!"},{"$error":"#VALUE!"},{"$error":"#VALUE!"},0,{"$f":"AD191+AE190","v":0},{"$f":"AF190+W191","v":{"$error":"#VALUE!"}},{"$f":"AG190+AB191","v":{"$error":"#VALUE!"}},0,0]
[null,null,null,null,null,null,null,null,null,null,null,null,null,null,null,null,{"$error":"#VALUE!"},0,0,0,0,{"$error":"#VALUE!"},{"$error":"#VALUE!"},0,0,0,{"$error":"#VALUE!"},{"$error":"#VALUE!"},{"$error":"#VALUE!"},0,0,{"$error":"#VALUE!"},{"$error":"#VALUE!"},0,0]
[null,null,null,null,null,null,null,null,null,null,null,null,null,null,null,null,{"$error":"#VALUE!"},0,0,0,0,{"$error":"#VALUE!"},{"$error":"#VALUE!"},0,0,0,{"$error":"#VALUE!"},{"$error":"#VALUE!"},{"$error":"#VALUE!"},0,0,{"$error":"#VALUE!"},{"$error":"#VALUE!"},0,0]
[null,"Type de bâtiment","Catégorisation pour fiche CEE","Surface par type de bâtiment","Fiche CEE BAT TH 127 < 400 kW",null,null,"Type de bâtiment","Catégorisation pour fiche CEE","Surface par type de bâtiment","Fiche CEE BAT TH 127 > 400 kW",null,null,null,null,null,{"$error":"#VALUE!"},0,0,0,0,{"$error":"#VALUE!"},{"$error":"#VALUE!"},0,0,0,{"$error":"#VALUE!"},{"$error":"#VALUE!"},{"$error":"#VALUE!"},0,0,{"$error":"#VALUE!"},{"$error":"#VALUE!"},0,0]
[null,null,null,null,"Coefficient chauffage","Coefficient chauffage + ECS",null,null,null,null,"Coefficient chauffage","Coefficient chauffage + ECS",null,null,null,null,{"$error":"#VALUE!"},0,0,0,0,{"$error":"#VALUE!"},{"$error":"#VALUE!"},0,0,0,{"$error":"#VALUE!"},{"$error":"#VALUE!"},{"$error":"#VALUE!"},0,0,{"$error":"#VALUE!"},{"$error":"#VALUE!"},0,0]
[null,{"$f":"'données d''entrée'!Y3","v":"Logements collectifs /Résidences étudiantes"},null,{"$f":"IFERROR(SUMIFS($E$9:$E$33,$B$9:$B$33,B196,$D$70:$D$94,\"<400\"),0)","v":0},{"$f":"'données d''entrée'!AA3","v":0},{"$f":"'données d''entrée'!AB3","v":0},null,{"$f":"'données d''entrée'!AE3","v":"Logements collectifs /Résidences étudiantes"},null,{"$f":"IFERROR(SUMIFS($E$9:$E$33,$B$9:$B$33,H196,$D$70:$D$94,\">400\"),0)","v":0},{"$f":"'données d''entrée'!AG3","v":0},{"$f":"'données d''entrée'!AH3","v":0},null,null,null,null,{"$error":"#VALUE!"},0,0,0,0,{"$error":"#VALUE!"},{"$error":"#VALUE!"},0,0,0,{"$error":"#VALUE!"},{"$error":"#VALUE!"},{"$error":"#VALUE!"},0,0,{"$error":"#VALUE!"},{"$error":"#VALUE!"},0,0]
[null,{"$f":"'données d''entrée'!Y4","v":" EHPAD"},"Santé",{"$f":"IFERROR(SUMIFS($E$9:$E$33,$B$9:$B$33,B197,$D$70:$D$94,\"<400\"),0)","v":0},{"$f":"'données d''entrée'!AA4","v":400},{"$f":"'données d''entrée'!AB4","v":540},null,{"$f":"'données d''entrée'!AE4","v":" EHPAD"},"Santé",{"$f":"IFERROR(SUMIFS($E$9:$E$33,$B$9:$B$33,H197,$D$70:$D$94,\">400\"),0)","v":0},{"$f":"'données d''entrée'!AG4","v":310},{"$f":"'données d''entrée'!AH4","v":410},null,null,null,null,{"$error":"#VALUE!"},0,0,0,0,{"$error":"#VALUE!"},{"$error":"#VALUE!"},0,0,0,{"$error":"#VALUE!"},{"$error":"#VALUE!"},{"$error":"#VALUE!"},0,0,{"$error":"#VALUE!"},{"$error":"#VALUE!"},0,0]
[null,{"$f":"'données d''entrée'!Y5","v":"Maisons individuelles"},null,0,{"$f":"'données d''entrée'!AA5","v":0},{"$f":"'données d''entrée'!AB5","v":0},null,{"$f":"'données d''entrée'!AE5","v":"Maisons indivduelles"},null,0,{"$f":"'données d''entrée'!AG5","v":0},{"$f":"'données d''entrée'!AH5","v":0},null,null,null,null,{"$error":"#VALUE!"},0,0,0,0,{"$error":"#VALUE!"},{"$error":"#VALUE!"},0,0,0,{"$error":"#VALUE!"},{"$error":"#VALUE!"},{"$error":"#VALUE!"},0,0,{"$error":"#VALUE!"},{"$error":"#VALUE!"},0,0]
[null,{"$f":"'données d''entrée'!Y6","v":"Bureaux"},"Bureaux",0,{"$f":"'données d''entrée'!AA6","v":480},{"$f":"'données d''entrée'!AB6","v":510},null,{"$f":"'données d''entrée'!AE6","v":"Bureaux"},"Bureaux",0,{"$f":"'données d''entrée'!AG6","v":370},{"$f":"'données d''entrée'!AH6","v":390},null,null,null,null,{"$error":"#VALUE!"},0,0,0,0,{"$error":"#VALUE!"},{"$error":"#VALUE!"},0,0,0,{"$error":"#VALUE!"},{"$error":"#VALUE!"},{"$error":"#VALUE!"},0,0,{"$error":"#VALUE!"},{"$error":"#VALUE!"},0,0]
[null,{"$f":"'données d''entrée'!Y7","v":" Lycées avec internat"},"Enseignement",0,{"$f":"'données d''entrée'!AA7","v":310},{"$f":"'données d''entrée'!AB7","v":360},null,{"$f":"'données d''entrée'!AE7","v":" Lycées avec internat"},"Enseignement",0,{"$f":"'données d''entrée'!AG7","v":240},{"$f":"'données d''entrée'!AH7","v":270},null,null,null,null,{"$error":"#VALUE!"},0,0,0,0,{"$error":"#VALUE!"},{"$error":"#VALUE!"},0,0,0,{"$error":"#VALUE!"},{"$error":"#VALUE!"},{"$error":"#VALUE!"},0,0,{"$error":"#VALUE!"},{"$error":"#VALUE!"},0,0]
[null,{"$f":"'données d''entrée'!Y8","v":"Crèches/ Écoles/ Collèges/ Lycée sans internat"},"Enseignement",0,{"$f":"'données d''entrée'!AA8","v":310},{"$f":"'données d''entrée'!AB8","v":360},null,{"$f":"'données d''entrée'!AE8","v":"Crèches/ Écoles/ Collèges/ Lycée sans internat"},"Enseignement",0,{"$f":"'données d''entrée'!AG8","v":240},{"$f":"'données d''entrée'!AH8","v":270},null,null,null,null,{"$error":"#VALUE!"},{"$f":"SUM(R181:R200)","v":0},0,0,0,{"$error":"#VALUE!"},{"$error":"#VALUE!"},0,0,0,{"$error":"#VALUE!"},{"$error":"#VALUE!"},{"$error":"#VALUE!"},{"$f":"X201+Y201-R201-S201-T201","v":0},{"$f":"AD201+AE200","v":0},{"$f":"AF200+W201","v":{"$error":"#VALUE!"}},{"$f":"AG200+AB201","v":{"$error":"#VALUE!"}},0,{"$f":"$R$63+Z201","v":0}]
[null,{"$f":"'données d''entrée'!Y9","v":"Café / hôtels / restaurants"},"Hôtellerie/restauration",0,{"$f":"'données d''entrée'!AA4","v":400},{"$f":"'données d''entrée'!AB4","v":540},null,{"$f":"'données d''entrée'!AE9","v":"Café / hôtels / restaurants"},"Hôtellerie/restauration",0,{"$f":"'données d''entrée'!AG9","v":410},{"$f":"'données d''entrée'!AH9","v":520}]
[null,{"$f":"'données d''entrée'!Y10","v":"Hopitaux / cliniques"},"Santé",0,{"$f":"'données d''entrée'!AA10","v":400},{"$f":"'données d''entrée'!AB10","v":540},null,{"$f":"'données d''entrée'!AE10","v":"Hopitaux / cliniques"},"Santé",0,{"$f":"'données d''entrée'!AG10","v":310},{"$f":"'données d''entrée'!AH10","v":410}]
[null,{"$f":"'données d''entrée'!Y11","v":"Commerces"},"Commerces",0,{"$f":"'données d''entrée'!AA11","v":370},{"$f":"'données d''entrée'!AB11","v":420},null,{"$f":"'données d''entrée'!AE11","v":"Commerces"},"Commerces",0,{"$f":"'données d''entrée'!AG11","v":280},{"$f":"'données d''entrée'!AH11","v":320}]
[null,{"$f":"'données d''entrée'!Y12","v":"Sports, culture, Loisirs et Equipements sportifs (SCLE)"},"Autres",0,{"$f":"'données d''entrée'!AA12","v":310},{"$f":"'données d''entrée'!AB12","v":330},null,{"$f":"'données d''entrée'!AE12","v":"Sports, culture, Loisirs et Equipements sportifs (SCLE)"},"Autres",0,{"$f":"'données d''entrée'!AG12","v":240},{"$f":"'données d''entrée'!AH12","v":260},null,null,null,null,"Coût du MWh utile en année 5"]
[null,{"$f":"'données d''entrée'!Y13","v":"Piscine"},"Autres",0,{"$f":"'données d''entrée'!AA13","v":310},{"$f":"'données d''entrée'!AB13","v":330},null,{"$f":"'données d''entrée'!AE13","v":"Piscine"},"Autres",0,{"$f":"'données d''entrée'!AG13","v":240},{"$f":"'données d''entrée'!AH13","v":260}]
[null,{"$f":"'données d''entrée'!Y14","v":"Bâtiments tertiaires mixtes"},"Autres",0,{"$f":"'données d''entrée'!AA14","v":310},{"$f":"'données d''entrée'!AB14","v":330},null,{"$f":"'données d''entrée'!AE14","v":"Bâtiments tertiaires mixtes"},"Autres",0,{"$f":"'données d''entrée'!AG14","v":240},{"$f":"'données d''entrée'!AH14","v":260},null,null,null,null,null,"coût du MWh utile",null,"dépenses totales"]
[null,null,null,null,null,null,null,null,null,null,null,null,null,null,null,null,null,"bois","référence","bois","référence"]
[null,null,null,null,null,null,null,null,null,null,null,null,null,null,null,null,"P1 - énergie bois",{"$f":"IF($F$102=0,0,T209/$F$102)","v":0},{"$f":"IF($AY$39=0,0,U209/$F$102)","v":0},{"$f":"R186","v":0},0]
[null,null,null,null,null,null,null,null,null,null,null,null,null,null,null,null,"P1 - énergie appoint/ref",{"$f":"IF($F$102=0,0,T210/$F$102)","v":0},{"$f":"IF($AY$39=0,0,U210/$F$102)","v":0},{"$f":"S186","v":0},{"$f":"X186","v":0}]
[null,null,null,null,null,null,null,null,null,null,null,null,null,null,null,null,"P2 + P3 maintenance et GER",{"$f":"IF($F$102=0,0,T211/$F$102)","v":0},{"$f":"IF($AY$39=0,0,U211/$F$102)","v":0},{"$f":"T186","v":0},{"$f":"Y186","v":0}]
[]
[null,null,null,null,null,null,null,null,null,null,null,null,null,null,null,null,"P4 - amortissements",{"$f":"IF($F$102=0,0,T213/$F$102)","v":0},{"$f":"IF($AY$39=0,0,U213/$F$102)","v":0},{"$f":"V186","v":{"$error":"#VALUE!"}},{"$f":"AA186","v":{"$error":"#VALUE!"}}]
[null,null,null,null,null,null,null,null,null,null,null,null,null,null,null,null,"TOTAL",{"$f":"SUM(R209:R213)","v":0},{"$f":"SUM(S209:S213)","v":0},{"$f":"SUM(T209:T213)","v":{"$error":"#VALUE!"}},{"$f":"SUM(U209:U213)","v":{"$error":"#VALUE!"}}]
[null,null,null,null,null,null,null,null,null,null,null,null,null,null,null,null,{"$f":"IF(W7=\"oui\",IF(W8=\"oui\",\"\",\"TVA (si vente chaleur)\"),\"\")","v":""},{"$f":"IF(W7=\"oui\",IF(W8=\"oui\",\"\",0.055*R214),\"\")","v":""},{"$f":"IF(W7=\"oui\",IF(W8=\"oui\",\"\",0.2*S214),\"\")","v":""}]
[null,null,null,null,null,null,null,null,null,null,null,null,null,null,null,null,{"$f":"IF(W7=\"oui\",IF(W8=\"oui\",\"\",\"TOTAL TTC\"),\"\")","v":""},{"$f":"IF(W7=\"oui\",IF(W8=\"oui\",\"\",R214+R215),\"\")","v":""},{"$f":"IF(W7=\"oui\",IF(W8=\"oui\",\"\",S214+S215),\"\")","v":""}]

{"sheet":"Scénario 2","index":3,"n_rows":216,"n_cols":91,"rows_kept":216,"cut":false,"hidden":false,"merged":[[2,1,2,13],[2,16,2,28],[0,1,0,14],[0,16,0,28],[1,2,1,4],[1,5,1,6],[1,7,1,13],[98,16,98,20],[97,22,97,26],[66,1,66,14],[66,16,66,20],[66,22,66,27],[67,1,67,4],[70,24,70,25],[71,24,71,25],[95,1,95,13],[96,1,96,5],[96,8,96,13],[98,3,98,4],[86,23,86,24],[193,7,194,7],[193,8,194,8],[193,9,194,9],[193,10,193,11],[108,3,108,4],[177,16,177,34],[204,16,205,20],[109,3,109,4],[206,17,206,18],[206,19,206,20],[145,16,145,33],[122,16,122,34],[111,1,111,13],[193,1,194,1],[193,2,194,2],[193,3,194,3],[193,4,193,5],[122,1,122,14],[123,8,123,14],[165,3,165,4],[167,7,167,13],[5,1,5,14],[6,1,6,14],[36,1,36,9],[35,1,35,9],[65,16,65,27],[5,16,5,17],[5,19,5,22],[5,24,5,25],[6,19,6,21],[7,19,7,21],[8,19,8,21],[34,16,34,25]]}
[null,{"$f":"'données d''entrée'!E1","v":"installation d'une chaufferie bois  - [nom du projet] à [lieu du projet]"},null,null,null,null,null,null,null,null,null,null,null,null,null,null,{"$f":"B1","v":"installation d'une chaufferie bois  - [nom du projet] à [lieu du projet]"}]
[null,"Titre scénario :",{"$f":"TRIM(RIGHT(SUBSTITUTE(CELL(\"nomfichier\",B1),\"]\",REPT(\" \",100)),100))","v":"Scénario 2"},null,null,"Détail scénario: "]
[null,"PARTIE TECHNIQUE",null,null,null,null,null,null,null,null,null,null,null,null,null,null,"PARTIE ECONOMIQUE"]
[null,{"$f":"'données d''entrée'!D2","v":"Version 13 02/06/2026"}]
[]
[null,"1/ SITUATION ACTUELLE",null,null,null,null,null,null,null,null,null,null,null,null,null,null,"7/ PORTEUR DE PROJET",null,null,"8/ DEFINITION DU REGIME TVA",null,null,null,null,"9/ PRIX DES COMBUSTIBLES (€ HT/MWH)"]
[null,"Caractéristiques de l'installation",null,null,null,null,null,null,null,null,null,null,null,null,null,null,"qui est le maitre d'ouvrage du projet ?",{"$f":"IF('données d''entrée'!E4=0,\" \",'données d''entrée'!E4)","v":" "},null,"Y aura-t-il vente de chaleur à 2 abonnés minimum ?",null,null,null,null,"bois déchiqueté",{"$f":"IF('données d''entrée'!Q4=0,\" \",IF('Synthèse pour trame'!$B$82='Scénario 2'!Y7,'données d''entrée'!Q4*(1+'Synthèse pour trame'!$W$86),'données d''entrée'!Q4))","v":35},null,null,null,null,null,null,null,null,null,null,null,null,null,null,null,null,null,null,null,null,null,null,null,null,null,null,null,null,null,null,null,null,null,null,null,null,null,null,null,null,null,null,null,null,null,null,null,null,null,null,null,null,null,null,null,null,null,null,null,null,null,null,null,null,"test"]
[null,"Type de bâtiment","Nombre de logements si résidentiel collectif ou individuel","Bâtiment(s)","surface à chauffer (m2)","énergie actuelle utilisée","puissance installée (kW)","consommation moyenne sur 3 ans\n( chauffage + ECS ; MWh PCI)","Consommation d'ECS (si non connue, 0)","Rendement de production de référence","besoin utile ( chauffage + ECS ; MWh PCI)","Ratio de consommation énergétique de chauffage seul en kWh/m²","Révision ratio pour plafonnement","année installation","vétusté  actuelle",null,"Année de démarrage du projet ?",{"$f":"IF('données d''entrée'!E5=0,\" \",'données d''entrée'!E5)","v":" "},null,"Le client récupère-t-il la TVA?",null,null,null,null,"électricité",{"$f":"IF('données d''entrée'!Q5=0,\" \",IF('Synthèse pour trame'!$B$82='Scénario 2'!Y8,'données d''entrée'!Q5*(1+'Synthèse pour trame'!$W$86),'données d''entrée'!Q5))","v":200},null,null,null,null,null,null,null,null,null,null,null,null,null,null,null,null,null,null,null,null,null,null,null,null,null,null,null,null,null,null,null,null,null,null,null,null,null,null,null,null,null,null,null,null,null,null,null,null,null,null,null,null,null,null,null,null,null,null,null,null,null,null,null,null,{"$f":"IF(AE181>($U$95-$R$63),0,1)","v":1}]
[null,{"$f":"IF('données d''entrée'!B11=0,\" \",'données d''entrée'!B11)","v":" "},{"$f":"IF('données d''entrée'!C11=0,\" \",'données d''entrée'!C11)","v":" "},{"$f":"IF('données d''entrée'!D11=0,\" \",'données d''entrée'!D11)","v":" "},{"$f":"IF('données d''entrée'!E11=0,0,'données d''entrée'!E11)","v":0},{"$f":"IF('données d''entrée'!F11=0,\" \",'données d''entrée'!F11)","v":" "},{"$f":"IF('données d''entrée'!G11=0,\" \",'données d''entrée'!G11)","v":" "},{"$f":"IF('données d''entrée'!H11=0,\" \",'données d''entrée'!H11)","v":" "},{"$f":"IF('données d''entrée'!I11=0,0,'données d''entrée'!I11)","v":0},{"$f":"IF('données d''entrée'!J11=0,\" \",'données d''entrée'!J11)","v":" "},{"$f":"IF(OR(H9=\" \",J9=\" \"),\"\",(H9)*J9)","v":""},{"$f":"IF('données d''entrée'!L11=0,\" \",'données d''entrée'!L11)","v":""},{"$f":"IFERROR(_xlfn.IFS(\nAND(OR(B9=$B$197,B9=$B$199,B9=$B$200,B9=$B$201,B9=$B$202,B9=$B$203,B9=$B$204,B9=$B$205,B9=$B$207),L9>100),100,\nAND(OR(B9=$B$197,B9=$B$199,B9=$B$200,B9=$B$201,B9=$B$202,B9=$B$203,B9=$B$204,B9=$B$205,B9=$B$207),L9<=100),L9,\nAND(OR(B9=$B$196,B9=$B$198),L9>90),90,\nAND(OR(B9=$B$196,B9=$B$198),L9<=90),L9,\nOR(B9=\"\",B9=$B$206),L9),0)","v":0},{"$f":"IF('données d''entrée'!M11=0,\" \",'données d''entrée'!M11)","v":" "},{"$f":"IFERROR(IF(OR('données d''entrée'!N11<>0,AND('données d''entrée'!N11=0,N9-$R$8>=0)),'données d''entrée'!N11,\"\"),\"\")","v":""},{"$f":"IF(AND(E9<=7500,B9<>B196,B9<>B198),1,0)","v":1},{"$f":"IF(AND(C9<=125,OR(B9=C196,B9=C198)),1,0)","v":0},null,null,"Taux de TVA sur investissement si pas de récupération de TVA (/!\\ FCTVA 16,4%?) :",null,null,null,null,"fioul",{"$f":"IF('données d''entrée'!Q6=0,\" \",IF('Synthèse pour trame'!$B$82='Scénario 2'!Y9,'données d''entrée'!Q6*(1+'Synthèse pour trame'!$W$86),'données d''entrée'!Q6))","v":110},null,null,null,null,null,null,null,null,null,null,null,null,null,null,null,null,null,null,null,null,null,null,null,null,null,null,null,null,null,null,null,null,null,null,null,null,null,null,null,null,null,null,null,null,null,null,null,null,null,null,null,null,null,null,null,null,null,null,null,null,null,null,null,null,1]
[null,{"$f":"IF('données d''entrée'!B12=0,\" \",'données d''entrée'!B12)","v":" "},{"$f":"IF('données d''entrée'!C12=0,\" \",'données d''entrée'!C12)","v":" "},{"$f":"IF('données d''entrée'!D12=0,\" \",'données d''entrée'!D12)","v":" "},{"$f":"IF('données d''entrée'!E12=0,0,'données d''entrée'!E12)","v":0},{"$f":"IF('données d''entrée'!F12=0,\" \",'données d''entrée'!F12)","v":" "},{"$f":"IF('données d''entrée'!G12=0,\" \",'données d''entrée'!G12)","v":" "},{"$f":"IF('données d''entrée'!H12=0,\" \",'données d''entrée'!H12)","v":" "},{"$f":"IF('données d''entrée'!I12=0,0,'données d''entrée'!I12)","v":0},{"$f":"IF('données d''entrée'!J12=0,\" \",'données d''entrée'!J12)","v":" "},{"$f":"IF(OR(H10=\" \",J10=\" \"),\"\",(H10)*J10)","v":""},{"$f":"IF('données d''entrée'!L12=0,\" \",'données d''entrée'!L12)","v":""},{"$f":"IFERROR(_xlfn.IFS(\nAND(OR(B10=$B$197,B10=$B$199,B10=$B$200,B10=$B$201,B10=$B$202,B10=$B$203,B10=$B$204,B10=$B$205,B10=$B$207),L10>100),100,\nAND(OR(B10=$B$197,B10=$B$199,B10=$B$200,B10=$B$201,B10=$B$202,B10=$B$203,B10=$B$204,B10=$B$205,B10=$B$207),L10<=100),L10,\nAND(OR(B10=$B$196,B10=$B$198),L10>90),90,\nAND(OR(B10=$B$196,B10=$B$198),L10<=90),L10,\nOR(B10=\"\",B10=$B$206),L10),0)","v":0},{"$f":"IF('données d''entrée'!M12=0,\" \",'données d''entrée'!M12)","v":" "},{"$f":"IFERROR(IF(OR('données d''entrée'!N12<>0,AND('données d''entrée'!N12=0,N10-$R$8>=0)),'données d''entrée'!N12,\"\"),\"\")","v":""},{"$f":"IF(AND(E10<=7500,B10<>B197,B10<>B199),1,0)","v":1},{"$f":"IF(AND(C10<=125,OR(B10=C197,B10=C199)),1,0)","v":0},null,null,null,null,null,null,null,"gaz naturel",{"$f":"IF('données d''entrée'!Q7=0,\" \",IF('Synthèse pour trame'!$B$82='Scénario 2'!Y10,'données d''entrée'!Q7*(1+'Synthèse pour trame'!$W$86),'données d''entrée'!Q7))","v":100},null,null,null,null,null,null,null,null,null,null,null,null,null,null,null,null,null,null,null,null,null,null,null,null,null,null,null,null,null,null,null,null,null,null,null,null,null,null,null,null,null,null,null,null,null,null,null,null,null,null,null,null,null,null,null,null,null,null,null,null,null,null,null,null,1]
[null,{"$f":"IF('données d''entrée'!B13=0,\" \",'données d''entrée'!B13)","v":" "},{"$f":"IF('données d''entrée'!C13=0,\" \",'données d''entrée'!C13)","v":" "},{"$f":"IF('données d''entrée'!D13=0,\" \",'données d''entrée'!D13)","v":" "},{"$f":"IF('données d''entrée'!E13=0,0,'données d''entrée'!E13)","v":0},{"$f":"IF('données d''entrée'!F13=0,\" \",'données d''entrée'!F13)","v":" "},{"$f":"IF('données d''entrée'!G13=0,\" \",'données d''entrée'!G13)","v":" "},{"$f":"IF('données d''entrée'!H13=0,\" \",'données d''entrée'!H13)","v":" "},{"$f":"IF('données d''entrée'!I13=0,0,'données d''entrée'!I13)","v":0},{"$f":"IF('données d''entrée'!J13=0,\" \",'données d''entrée'!J13)","v":" "},"",{"$f":"IF('données d''entrée'!L13=0,\" \",'données d''entrée'!L13)","v":""},{"$f":"IFERROR(_xlfn.IFS(\nAND(OR(B11=$B$197,B11=$B$199,B11=$B$200,B11=$B$201,B11=$B$202,B11=$B$203,B11=$B$204,B11=$B$205,B11=$B$207),L11>100),100,\nAND(OR(B11=$B$197,B11=$B$199,B11=$B$200,B11=$B$201,B11=$B$202,B11=$B$203,B11=$B$204,B11=$B$205,B11=$B$207),L11<=100),L11,\nAND(OR(B11=$B$196,B11=$B$198),L11>90),90,\nAND(OR(B11=$B$196,B11=$B$198),L11<=90),L11,\nOR(B11=\"\",B11=$B$206),L11),0)","v":0},{"$f":"IF('données d''entrée'!M13=0,\" \",'données d''entrée'!M13)","v":" "},{"$f":"IFERROR(IF(OR('données d''entrée'!N13<>0,AND('données d''entrée'!N13=0,N11-$R$8>=0)),'données d''entrée'!N13,\"\"),\"\")","v":""},1,0,null,null,null,null,null,null,null,"granulé",{"$f":"IF('données d''entrée'!Q8=0,\" \",IF('Synthèse pour trame'!$B$82='Scénario 2'!Y11,'données d''entrée'!Q8*(1+'Synthèse pour trame'!$W$86),'données d''entrée'!Q8))","v":77},null,null,null,null,null,null,null,null,null,null,null,null,null,null,null,null,null,null,null,null,null,null,null,null,null,null,null,null,null,null,null,null,null,null,null,null,null,null,null,null,null,null,null,null,null,null,null,null,null,null,null,null,null,null,null,null,null,null,null,null,null,null,null,null,1]
[null,{"$f":"IF('données d''entrée'!B14=0,\" \",'données d''entrée'!B14)","v":" "},{"$f":"IF('données d''entrée'!C14=0,\" \",'données d''entrée'!C14)","v":" "},{"$f":"IF('données d''entrée'!D14=0,\" \",'données d''entrée'!D14)","v":" "},{"$f":"IF('données d''entrée'!E14=0,0,'données d''entrée'!E14)","v":0},{"$f":"IF('données d''entrée'!F14=0,\" \",'données d''entrée'!F14)","v":" "},{"$f":"IF('données d''entrée'!G14=0,\" \",'données d''entrée'!G14)","v":" "},{"$f":"IF('données d''entrée'!H14=0,\" \",'données d''entrée'!H14)","v":" "},{"$f":"IF('données d''entrée'!I14=0,0,'données d''entrée'!I14)","v":0},{"$f":"IF('données d''entrée'!J14=0,\" \",'données d''entrée'!J14)","v":" "},"",{"$f":"IF('données d''entrée'!L14=0,\" \",'données d''entrée'!L14)","v":""},{"$f":"IFERROR(_xlfn.IFS(\nAND(OR(B12=$B$197,B12=$B$199,B12=$B$200,B12=$B$201,B12=$B$202,B12=$B$203,B12=$B$204,B12=$B$205,B12=$B$207),L12>100),100,\nAND(OR(B12=$B$197,B12=$B$199,B12=$B$200,B12=$B$201,B12=$B$202,B12=$B$203,B12=$B$204,B12=$B$205,B12=$B$207),L12<=100),L12,\nAND(OR(B12=$B$196,B12=$B$198),L12>90),90,\nAND(OR(B12=$B$196,B12=$B$198),L12<=90),L12,\nOR(B12=\"\",B12=$B$206),L12),0)","v":0},{"$f":"IF('données d''entrée'!M14=0,\" \",'données d''entrée'!M14)","v":" "},{"$f":"IFERROR(IF(OR('données d''entrée'!N14<>0,AND('données d''entrée'!N14=0,N12-$R$8>=0)),'données d''entrée'!N14,\"\"),\"\")","v":""},1,0,null,null,null,null,null,null,null,"propane",{"$f":"IF('données d''entrée'!Q9=0,\" \",IF('Synthèse pour trame'!$B$82='Scénario 2'!Y12,'données d''entrée'!Q9*(1+'Synthèse pour trame'!$W$86),'données d''entrée'!Q9))","v":117},null,null,null,null,null,null,null,null,null,null,null,null,null,null,null,null,null,null,null,null,null,null,null,null,null,null,null,null,null,null,null,null,null,null,null,null,null,null,null,null,null,null,null,null,null,null,null,null,null,null,null,null,null,null,null,null,null,null,null,null,null,null,null,null,1]
[null,{"$f":"IF('données d''entrée'!B15=0,\" \",'données d''entrée'!B15)","v":" "},{"$f":"IF('données d''entrée'!C15=0,\" \",'données d''entrée'!C15)","v":" "},{"$f":"IF('données d''entrée'!D15=0,\" \",'données d''entrée'!D15)","v":" "},{"$f":"IF('données d''entrée'!E15=0,0,'données d''entrée'!E15)","v":0},{"$f":"IF('données d''entrée'!F15=0,\" \",'données d''entrée'!F15)","v":" "},{"$f":"IF('données d''entrée'!G15=0,\" \",'données d''entrée'!G15)","v":" "},{"$f":"IF('données d''entrée'!H15=0,\" \",'données d''entrée'!H15)","v":" "},{"$f":"IF('données d''entrée'!I15=0,0,'données d''entrée'!I15)","v":0},{"$f":"IF('données d''entrée'!J15=0,\" \",'données d''entrée'!J15)","v":" "},"",{"$f":"IF('données d''entrée'!L15=0,\" \",'données d''entrée'!L15)","v":""},{"$f":"IFERROR(_xlfn.IFS(\nAND(OR(B13=$B$197,B13=$B$199,B13=$B$200,B13=$B$201,B13=$B$202,B13=$B$203,B13=$B$204,B13=$B$205,B13=$B$207),L13>100),100,\nAND(OR(B13=$B$197,B13=$B$199,B13=$B$200,B13=$B$201,B13=$B$202,B13=$B$203,B13=$B$204,B13=$B$205,B13=$B$207),L13<=100),L13,\nAND(OR(B13=$B$196,B13=$B$198),L13>90),90,\nAND(OR(B13=$B$196,B13=$B$198),L13<=90),L13,\nOR(B13=\"\",B13=$B$206),L13),0)","v":0},{"$f":"IF('données d''entrée'!M15=0,\" \",'données d''entrée'!M15)","v":" "},{"$f":"IFERROR(IF(OR('données d''entrée'!N15<>0,AND('données d''entrée'!N15=0,N13-$R$8>=0)),'données d''entrée'!N15,\"\"),\"\")","v":""},1,0,null,null,null,null,null,null,null,null,null,null,null,null,null,null,null,null,null,null,null,null,null,null,null,null,null,null,null,null,null,null,null,null,null,null,null,null,null,null,null,null,null,null,null,null,null,null,null,null,null,null,null,null,null,null,null,null,null,null,null,null,null,null,null,null,null,null,null,null,null,null,null,null,null,1]
[null,{"$f":"IF('données d''entrée'!B16=0,\" \",'données d''entrée'!B16)","v":" "},{"$f":"IF('données d''entrée'!C16=0,\" \",'données d''entrée'!C16)","v":" "},{"$f":"IF('données d''entrée'!D16=0,\" \",'données d''entrée'!D16)","v":" "},{"$f":"IF('données d''entrée'!E16=0,0,'données d''entrée'!E16)","v":0},{"$f":"IF('données d''entrée'!F16=0,\" \",'données d''entrée'!F16)","v":" "},{"$f":"IF('données d''entrée'!G16=0,\" \",'données d''entrée'!G16)","v":" "},{"$f":"IF('données d''entrée'!H16=0,\" \",'données d''entrée'!H16)","v":" "},{"$f":"IF('données d''entrée'!I16=0,0,'données d''entrée'!I16)","v":0},{"$f":"IF('données d''entrée'!J16=0,\" \",'données d''entrée'!J16)","v":" "},"",{"$f":"IF('données d''entrée'!L16=0,\" \",'données d''entrée'!L16)","v":""},{"$f":"IFERROR(_xlfn.IFS(\nAND(OR(B14=$B$197,B14=$B$199,B14=$B$200,B14=$B$201,B14=$B$202,B14=$B$203,B14=$B$204,B14=$B$205,B14=$B$207),L14>100),100,\nAND(OR(B14=$B$197,B14=$B$199,B14=$B$200,B14=$B$201,B14=$B$202,B14=$B$203,B14=$B$204,B14=$B$205,B14=$B$207),L14<=100),L14,\nAND(OR(B14=$B$196,B14=$B$198),L14>90),90,\nAND(OR(B14=$B$196,B14=$B$198),L14<=90),L14,\nOR(B14=\"\",B14=$B$206),L14),0)","v":0},{"$f":"IF('données d''entrée'!M16=0,\" \",'données d''entrée'!M16)","v":" "},{"$f":"IFERROR(IF(OR('données d''entrée'!N16<>0,AND('données d''entrée'!N16=0,N14-$R$8>=0)),'données d''entrée'!N16,\"\"),\"\")","v":""},1,0,null,null,null,null,null,null,null,null,null,null,null,null,null,null,null,null,null,null,null,null,null,null,null,null,null,null,null,null,null,null,null,null,null,null,null,null,null,null,null,null,null,null,null,null,null,null,null,null,null,null,null,null,null,null,null,null,null,null,null,null,null,null,null,null,null,null,null,null,null,null,null,null,null,1]
[null,{"$f":"IF('données d''entrée'!B17=0,\" \",'données d''entrée'!B17)","v":" "},{"$f":"IF('données d''entrée'!C17=0,\" \",'données d''entrée'!C17)","v":" "},{"$f":"IF('données d''entrée'!D17=0,\" \",'données d''entrée'!D17)","v":" "},{"$f":"IF('données d''entrée'!E17=0,0,'données d''entrée'!E17)","v":0},{"$f":"IF('données d''entrée'!F17=0,\" \",'données d''entrée'!F17)","v":" "},{"$f":"IF('données d''entrée'!G17=0,\" \",'données d''entrée'!G17)","v":" "},{"$f":"IF('données d''entrée'!H17=0,\" \",'données d''entrée'!H17)","v":" "},{"$f":"IF('données d''entrée'!I17=0,0,'données d''entrée'!I17)","v":0},{"$f":"IF('données d''entrée'!J17=0,\" \",'données d''entrée'!J17)","v":" "},"",{"$f":"IF('données d''entrée'!L17=0,\" \",'données d''entrée'!L17)","v":""},{"$f":"IFERROR(_xlfn.IFS(\nAND(OR(B15=$B$197,B15=$B$199,B15=$B$200,B15=$B$201,B15=$B$202,B15=$B$203,B15=$B$204,B15=$B$205,B15=$B$207),L15>100),100,\nAND(OR(B15=$B$197,B15=$B$199,B15=$B$200,B15=$B$201,B15=$B$202,B15=$B$203,B15=$B$204,B15=$B$205,B15=$B$207),L15<=100),L15,\nAND(OR(B15=$B$196,B15=$B$198),L15>90),90,\nAND(OR(B15=$B$196,B15=$B$198),L15<=90),L15,\nOR(B15=\"\",B15=$B$206),L15),0)","v":0},{"$f":"IF('données d''entrée'!M17=0,\" \",'données d''entrée'!M17)","v":" "},{"$f":"IFERROR(IF(OR('données d''entrée'!N17<>0,AND('données d''entrée'!N17=0,N15-$R$8>=0)),'données d''entrée'!N17,\"\"),\"\")","v":""},1,0,null,null,null,null,null,null,null,null,null,null,null,null,null,null,null,null,null,null,null,null,null,null,null,null,null,null,null,null,null,null,null,null,null,null,null,null,null,null,null,null,null,null,null,null,null,null,null,null,null,null,null,null,null,null,null,null,null,null,null,null,null,null,null,null,null,null,null,null,null,null,null,null,null,1]
[null,{"$f":"IF('données d''entrée'!B18=0,\" \",'données d''entrée'!B18)","v":" "},{"$f":"IF('données d''entrée'!C18=0,\" \",'données d''entrée'!C18)","v":" "},{"$f":"IF('données d''entrée'!D18=0,\" \",'données d''entrée'!D18)","v":" "},{"$f":"IF('données d''entrée'!E18=0,0,'données d''entrée'!E18)","v":0},{"$f":"IF('données d''entrée'!F18=0,\" \",'données d''entrée'!F18)","v":" "},{"$f":"IF('données d''entrée'!G18=0,\" \",'données d''entrée'!G18)","v":" "},{"$f":"IF('données d''entrée'!H18=0,\" \",'données d''entrée'!H18)","v":" "},{"$f":"IF('données d''entrée'!I18=0,0,'données d''entrée'!I18)","v":0},{"$f":"IF('données d''entrée'!J18=0,\" \",'données d''entrée'!J18)","v":" "},"",{"$f":"IF('données d''entrée'!L18=0,\" \",'données d''entrée'!L18)","v":""},{"$f":"IFERROR(_xlfn.IFS(\nAND(OR(B16=$B$197,B16=$B$199,B16=$B$200,B16=$B$201,B16=$B$202,B16=$B$203,B16=$B$204,B16=$B$205,B16=$B$207),L16>100),100,\nAND(OR(B16=$B$197,B16=$B$199,B16=$B$200,B16=$B$201,B16=$B$202,B16=$B$203,B16=$B$204,B16=$B$205,B16=$B$207),L16<=100),L16,\nAND(OR(B16=$B$196,B16=$B$198),L16>90),90,\nAND(OR(B16=$B$196,B16=$B$198),L16<=90),L16,\nOR(B16=\"\",B16=$B$206),L16),0)","v":0},{"$f":"IF('données d''entrée'!M18=0,\" \",'données d''entrée'!M18)","v":" "},{"$f":"IFERROR(IF(OR('données d''entrée'!N18<>0,AND('données d''entrée'!N18=0,N16-$R$8>=0)),'données d''entrée'!N18,\"\"),\"\")","v":""},1,0,null,null,null,null,null,null,null,null,null,null,null,null,null,null,null,null,null,null,null,null,null,null,null,null,null,null,null,null,null,null,null,null,null,null,null,null,null,null,null,null,null,null,null,null,null,null,null,null,null,null,null,null,null,null,null,null,null,null,null,null,null,null,null,null,null,null,null,null,null,null,null,null,null,1]
[null,{"$f":"IF('données d''entrée'!B19=0,\" \",'données d''entrée'!B19)","v":" "},{"$f":"IF('données d''entrée'!C19=0,\" \",'données d''entrée'!C19)","v":" "},{"$f":"IF('données d''entrée'!D19=0,\" \",'données d''entrée'!D19)","v":" "},{"$f":"IF('données d''entrée'!E19=0,0,'données d''entrée'!E19)","v":0},{"$f":"IF('données d''entrée'!F19=0,\" \",'données d''entrée'!F19)","v":" "},{"$f":"IF('données d''entrée'!G19=0,\" \",'données d''entrée'!G19)","v":" "},{"$f":"IF('données d''entrée'!H19=0,\" \",'données d''entrée'!H19)","v":" "},{"$f":"IF('données d''entrée'!I19=0,0,'données d''entrée'!I19)","v":0},{"$f":"IF('données d''entrée'!J19=0,\" \",'données d''entrée'!J19)","v":" "},"",{"$f":"IF('données d''entrée'!L19=0,\" \",'données d''entrée'!L19)","v":""},{"$f":"IFERROR(_xlfn.IFS(\nAND(OR(B17=$B$197,B17=$B$199,B17=$B$200,B17=$B$201,B17=$B$202,B17=$B$203,B17=$B$204,B17=$B$205,B17=$B$207),L17>100),100,\nAND(OR(B17=$B$197,B17=$B$199,B17=$B$200,B17=$B$201,B17=$B$202,B17=$B$203,B17=$B$204,B17=$B$205,B17=$B$207),L17<=100),L17,\nAND(OR(B17=$B$196,B17=$B$198),L17>90),90,\nAND(OR(B17=$B$196,B17=$B$198),L17<=90),L17,\nOR(B17=\"\",B17=$B$206),L17),0)","v":0},{"$f":"IF('données d''entrée'!M19=0,\" \",'données d''entrée'!M19)","v":" "},{"$f":"IFERROR(IF(OR('données d''entrée'!N19<>0,AND('données d''entrée'!N19=0,N17-$R$8>=0)),'données d''entrée'!N19,\"\"),\"\")","v":""},1,0,null,null,null,null,null,null,null,null,null,null,null,null,null,null,null,null,null,null,null,null,null,null,null,null,null,null,null,null,null,null,null,null,null,null,null,null,null,null,null,null,null,null,null,null,null,null,null,null,null,null,null,null,null,null,null,null,null,null,null,null,null,null,null,null,null,null,null,null,null,null,null,null,null,1]
[null,{"$f":"IF('données d''entrée'!B20=0,\" \",'données d''entrée'!B20)","v":" "},{"$f":"IF('données d''entrée'!C20=0,\" \",'données d''entrée'!C20)","v":" "},{"$f":"IF('données d''entrée'!D20=0,\" \",'données d''entrée'!D20)","v":" "},{"$f":"IF('données d''entrée'!E20=0,0,'données d''entrée'!E20)","v":0},{"$f":"IF('données d''entrée'!F20=0,\" \",'données d''entrée'!F20)","v":" "},{"$f":"IF('données d''entrée'!G20=0,\" \",'données d''entrée'!G20)","v":" "},{"$f":"IF('données d''entrée'!H20=0,\" \",'données d''entrée'!H20)","v":" "},{"$f":"IF('données d''entrée'!I20=0,0,'données d''entrée'!I20)","v":0},{"$f":"IF('données d''entrée'!J20=0,\" \",'données d''entrée'!J20)","v":" "},"",{"$f":"IF('données d''entrée'!L20=0,\" \",'données d''entrée'!L20)","v":""},{"$f":"IFERROR(_xlfn.IFS(\nAND(OR(B18=$B$197,B18=$B$199,B18=$B$200,B18=$B$201,B18=$B$202,B18=$B$203,B18=$B$204,B18=$B$205,B18=$B$207),L18>100),100,\nAND(OR(B18=$B$197,B18=$B$199,B18=$B$200,B18=$B$201,B18=$B$202,B18=$B$203,B18=$B$204,B18=$B$205,B18=$B$207),L18<=100),L18,\nAND(OR(B18=$B$196,B18=$B$198),L18>90),90,\nAND(OR(B18=$B$196,B18=$B$198),L18<=90),L18,\nOR(B18=\"\",B18=$B$206),L18),0)","v":0},{"$f":"IF('données d''entrée'!M20=0,\" \",'données d''entrée'!M20)","v":" "},{"$f":"IFERROR(IF(OR('données d''entrée'!N20<>0,AND('données d''entrée'!N20=0,N18-$R$8>=0)),'données d''entrée'!N20,\"\"),\"\")","v":""},1,0,null,null,null,null,null,null,null,null,null,null,null,null,null,null,null,null,null,null,null,null,null,null,null,null,null,null,null,null,null,null,null,null,null,null,null,null,null,null,null,null,null,null,null,null,null,null,null,null,null,null,null,null,null,null,null,null,null,null,null,null,null,null,null,null,null,null,null,null,null,null,null,null,null,1]
[null,{"$f":"IF('données d''entrée'!B21=0,\" \",'données d''entrée'!B21)","v":" "},{"$f":"IF('données d''entrée'!C21=0,\" \",'données d''entrée'!C21)","v":" "},{"$f":"IF('données d''entrée'!D21=0,\" \",'données d''entrée'!D21)","v":" "},{"$f":"IF('données d''entrée'!E21=0,0,'données d''entrée'!E21)","v":0},{"$f":"IF('données d''entrée'!F21=0,\" \",'données d''entrée'!F21)","v":" "},{"$f":"IF('données d''entrée'!G21=0,\" \",'données d''entrée'!G21)","v":" "},{"$f":"IF('données d''entrée'!H21=0,\" \",'données d''entrée'!H21)","v":" "},{"$f":"IF('données d''entrée'!I21=0,0,'données d''entrée'!I21)","v":0},{"$f":"IF('données d''entrée'!J21=0,\" \",'données d''entrée'!J21)","v":" "},"",{"$f":"IF('données d''entrée'!L21=0,\" \",'données d''entrée'!L21)","v":""},{"$f":"IFERROR(_xlfn.IFS(\nAND(OR(B19=$B$197,B19=$B$199,B19=$B$200,B19=$B$201,B19=$B$202,B19=$B$203,B19=$B$204,B19=$B$205,B19=$B$207),L19>100),100,\nAND(OR(B19=$B$197,B19=$B$199,B19=$B$200,B19=$B$201,B19=$B$202,B19=$B$203,B19=$B$204,B19=$B$205,B19=$B$207),L19<=100),L19,\nAND(OR(B19=$B$196,B19=$B$198),L19>90),90,\nAND(OR(B19=$B$196,B19=$B$198),L19<=90),L19,\nOR(B19=\"\",B19=$B$206),L19),0)","v":0},{"$f":"IF('données d''entrée'!M21=0,\" \",'données d''entrée'!M21)","v":" "},{"$f":"IFERROR(IF(OR('données d''entrée'!N21<>0,AND('données d''entrée'!N21=0,N19-$R$8>=0)),'données d''entrée'!N21,\"\"),\"\")","v":""},1,0,null,null,null,null,null,null,null,null,null,null,null,null,null,null,null,null,null,null,null,null,null,null,null,null,null,null,null,null,null,null,null,null,null,null,null,null,null,null,null,null,null,null,null,null,null,null,null,null,null,null,null,null,null,null,null,null,null,null,null,null,null,null,null,null,null,null,null,null,null,null,null,null,null,1]
[null,{"$f":"IF('données d''entrée'!B22=0,\" \",'données d''entrée'!B22)","v":" "},{"$f":"IF('données d''entrée'!C22=0,\" \",'données d''entrée'!C22)","v":" "},{"$f":"IF('données d''entrée'!D22=0,\" \",'données d''entrée'!D22)","v":" "},{"$f":"IF('données d''entrée'!E22=0,0,'données d''entrée'!E22)","v":0},{"$f":"IF('données d''entrée'!F22=0,\" \",'données d''entrée'!F22)","v":" "},{"$f":"IF('données d''entrée'!G22=0,\" \",'données d''entrée'!G22)","v":" "},{"$f":"IF('données d''entrée'!H22=0,\" \",'données d''entrée'!H22)","v":" "},{"$f":"IF('données d''entrée'!I22=0,0,'données d''entrée'!I22)","v":0},{"$f":"IF('données d''entrée'!J22=0,\" \",'données d''entrée'!J22)","v":" "},"",{"$f":"IF('données d''entrée'!L22=0,\" \",'données d''entrée'!L22)","v":""},{"$f":"IFERROR(_xlfn.IFS(\nAND(OR(B20=$B$197,B20=$B$199,B20=$B$200,B20=$B$201,B20=$B$202,B20=$B$203,B20=$B$204,B20=$B$205,B20=$B$207),L20>100),100,\nAND(OR(B20=$B$197,B20=$B$199,B20=$B$200,B20=$B$201,B20=$B$202,B20=$B$203,B20=$B$204,B20=$B$205,B20=$B$207),L20<=100),L20,\nAND(OR(B20=$B$196,B20=$B$198),L20>90),90,\nAND(OR(B20=$B$196,B20=$B$198),L20<=90),L20,\nOR(B20=\"\",B20=$B$206),L20),0)","v":0},{"$f":"IF('données d''entrée'!M22=0,\" \",'données d''entrée'!M22)","v":" "},{"$f":"IFERROR(IF(OR('données d''entrée'!N22<>0,AND('données d''entrée'!N22=0,N20-$R$8>=0)),'données d''entrée'!N22,\"\"),\"\")","v":""},1,0,null,null,null,null,null,null,null,null,null,null,null,null,null,null,null,null,null,null,null,null,null,null,null,null,null,null,null,null,null,null,null,null,null,null,null,null,null,null,null,null,null,null,null,null,null,null,null,null,null,null,null,null,null,null,null,null,null,null,null,null,null,null,null,null,null,null,null,null,null,null,null,null,null,1]
[null,{"$f":"IF('données d''entrée'!B23=0,\" \",'données d''entrée'!B23)","v":" "},{"$f":"IF('données d''entrée'!C23=0,\" \",'données d''entrée'!C23)","v":" "},{"$f":"IF('données d''entrée'!D23=0,\" \",'données d''entrée'!D23)","v":" "},{"$f":"IF('données d''entrée'!E23=0,0,'données d''entrée'!E23)","v":0},{"$f":"IF('données d''entrée'!F23=0,\" \",'données d''entrée'!F23)","v":" "},{"$f":"IF('données d''entrée'!G23=0,\" \",'données d''entrée'!G23)","v":" "},{"$f":"IF('données d''entrée'!H23=0,\" \",'données d''entrée'!H23)","v":" "},{"$f":"IF('données d''entrée'!I23=0,0,'données d''entrée'!I23)","v":0},{"$f":"IF('données d''entrée'!J23=0,\" \",'données d''entrée'!J23)","v":" "},"",{"$f":"IF('données d''entrée'!L23=0,\" \",'données d''entrée'!L23)","v":""},{"$f":"IFERROR(_xlfn.IFS(\nAND(OR(B21=$B$197,B21=$B$199,B21=$B$200,B21=$B$201,B21=$B$202,B21=$B$203,B21=$B$204,B21=$B$205,B21=$B$207),L21>100),100,\nAND(OR(B21=$B$197,B21=$B$199,B21=$B$200,B21=$B$201,B21=$B$202,B21=$B$203,B21=$B$204,B21=$B$205,B21=$B$207),L21<=100),L21,\nAND(OR(B21=$B$196,B21=$B$198),L21>90),90,\nAND(OR(B21=$B$196,B21=$B$198),L21<=90),L21,\nOR(B21=\"\",B21=$B$206),L21),0)","v":0},{"$f":"IF('données d''entrée'!M23=0,\" \",'données d''entrée'!M23)","v":" "},{"$f":"IFERROR(IF(OR('données d''entrée'!N23<>0,AND('données d''entrée'!N23=0,N21-$R$8>=0)),'données d''entrée'!N23,\"\"),\"\")","v":""},1,0,null,null,null,null,null,null,null,null,null,null,null,null,null,null,null,null,null,null,null,null,null,null,null,null,null,null,null,null,null,null,null,null,null,null,null,null,null,null,null,null,null,null,null,null,null,null,null,null,null,null,null,null,null,null,null,null,null,null,null,null,null,null,null,null,null,null,null,null,null,null,null,null,null,1]
[null,{"$f":"IF('données d''entrée'!B24=0,\" \",'données d''entrée'!B24)","v":" "},{"$f":"IF('données d''entrée'!C24=0,\" \",'données d''entrée'!C24)","v":" "},{"$f":"IF('données d''entrée'!D24=0,\" \",'données d''entrée'!D24)","v":" "},{"$f":"IF('données d''entrée'!E24=0,0,'données d''entrée'!E24)","v":0},{"$f":"IF('données d''entrée'!F24=0,\" \",'données d''entrée'!F24)","v":" "},{"$f":"IF('données d''entrée'!G24=0,\" \",'données d''entrée'!G24)","v":" "},{"$f":"IF('données d''entrée'!H24=0,\" \",'données d''entrée'!H24)","v":" "},{"$f":"IF('données d''entrée'!I24=0,0,'données d''entrée'!I24)","v":0},{"$f":"IF('données d''entrée'!J24=0,\" \",'données d''entrée'!J24)","v":" "},"",{"$f":"IF('données d''entrée'!L24=0,\" \",'données d''entrée'!L24)","v":""},{"$f":"IFERROR(_xlfn.IFS(\nAND(OR(B22=$B$197,B22=$B$199,B22=$B$200,B22=$B$201,B22=$B$202,B22=$B$203,B22=$B$204,B22=$B$205,B22=$B$207),L22>100),100,\nAND(OR(B22=$B$197,B22=$B$199,B22=$B$200,B22=$B$201,B22=$B$202,B22=$B$203,B22=$B$204,B22=$B$205,B22=$B$207),L22<=100),L22,\nAND(OR(B22=$B$196,B22=$B$198),L22>90),90,\nAND(OR(B22=$B$196,B22=$B$198),L22<=90),L22,\nOR(B22=\"\",B22=$B$206),L22),0)","v":0},{"$f":"IF('données d''entrée'!M24=0,\" \",'données d''entrée'!M24)","v":" "},{"$f":"IFERROR(IF(OR('données d''entrée'!N24<>0,AND('données d''entrée'!N24=0,N22-$R$8>=0)),'données d''entrée'!N24,\"\"),\"\")","v":""},1,0,null,null,null,null,null,null,null,null,null,null,null,null,null,null,null,null,null,null,null,null,null,null,null,null,null,null,null,null,null,null,null,null,null,null,null,null,null,null,null,null,null,null,null,null,null,null,null,null,null,null,null,null,null,null,null,null,null,null,null,null,null,null,null,null,null,null,null,null,null,null,null,null,null,1]
[null,{"$f":"IF('données d''entrée'!B25=0,\" \",'données d''entrée'!B25)","v":" "},{"$f":"IF('données d''entrée'!C25=0,\" \",'données d''entrée'!C25)","v":" "},{"$f":"IF('données d''entrée'!D25=0,\" \",'données d''entrée'!D25)","v":" "},{"$f":"IF('données d''entrée'!E25=0,0,'données d''entrée'!E25)","v":0},{"$f":"IF('données d''entrée'!F25=0,\" \",'données d''entrée'!F25)","v":" "},{"$f":"IF('données d''entrée'!G25=0,\" \",'données d''entrée'!G25)","v":" "},{"$f":"IF('données d''entrée'!H25=0,\" \",'données d''entrée'!H25)","v":" "},{"$f":"IF('données d''entrée'!I25=0,0,'données d''entrée'!I25)","v":0},{"$f":"IF('données d''entrée'!J25=0,\" \",'données d''entrée'!J25)","v":" "},"",{"$f":"IF('données d''entrée'!L25=0,\" \",'données d''entrée'!L25)","v":""},{"$f":"IFERROR(_xlfn.IFS(\nAND(OR(B23=$B$197,B23=$B$199,B23=$B$200,B23=$B$201,B23=$B$202,B23=$B$203,B23=$B$204,B23=$B$205,B23=$B$207),L23>100),100,\nAND(OR(B23=$B$197,B23=$B$199,B23=$B$200,B23=$B$201,B23=$B$202,B23=$B$203,B23=$B$204,B23=$B$205,B23=$B$207),L23<=100),L23,\nAND(OR(B23=$B$196,B23=$B$198),L23>90),90,\nAND(OR(B23=$B$196,B23=$B$198),L23<=90),L23,\nOR(B23=\"\",B23=$B$206),L23),0)","v":0},{"$f":"IF('données d''entrée'!M25=0,\" \",'données d''entrée'!M25)","v":" "},{"$f":"IFERROR(IF(OR('données d''entrée'!N25<>0,AND('données d''entrée'!N25=0,N23-$R$8>=0)),'données d''entrée'!N25,\"\"),\"\")","v":""},1,0,null,null,null,null,null,null,null,null,null,null,null,null,null,null,null,null,null,null,null,null,null,null,null,null,null,null,null,null,null,null,null,null,null,null,null,null,null,null,null,null,null,null,null,null,null,null,null,null,null,null,null,null,null,null,null,null,null,null,null,null,null,null,null,null,null,null,null,null,null,null,null,null,null,1]
[null,{"$f":"IF('données d''entrée'!B26=0,\" \",'données d''entrée'!B26)","v":" "},{"$f":"IF('données d''entrée'!C26=0,\" \",'données d''entrée'!C26)","v":" "},{"$f":"IF('données d''entrée'!D26=0,\" \",'données d''entrée'!D26)","v":" "},{"$f":"IF('données d''entrée'!E26=0,0,'données d''entrée'!E26)","v":0},{"$f":"IF('données d''entrée'!F26=0,\" \",'données d''entrée'!F26)","v":" "},{"$f":"IF('données d''entrée'!G26=0,\" \",'données d''entrée'!G26)","v":" "},{"$f":"IF('données d''entrée'!H26=0,\" \",'données d''entrée'!H26)","v":" "},{"$f":"IF('données d''entrée'!I26=0,0,'données d''entrée'!I26)","v":0},{"$f":"IF('données d''entrée'!J26=0,\" \",'données d''entrée'!J26)","v":" "},"",{"$f":"IF('données d''entrée'!L26=0,\" \",'données d''entrée'!L26)","v":""},{"$f":"IFERROR(_xlfn.IFS(\nAND(OR(B24=$B$197,B24=$B$199,B24=$B$200,B24=$B$201,B24=$B$202,B24=$B$203,B24=$B$204,B24=$B$205,B24=$B$207),L24>100),100,\nAND(OR(B24=$B$197,B24=$B$199,B24=$B$200,B24=$B$201,B24=$B$202,B24=$B$203,B24=$B$204,B24=$B$205,B24=$B$207),L24<=100),L24,\nAND(OR(B24=$B$196,B24=$B$198),L24>90),90,\nAND(OR(B24=$B$196,B24=$B$198),L24<=90),L24,\nOR(B24=\"\",B24=$B$206),L24),0)","v":0},{"$f":"IF('données d''entrée'!M26=0,\" \",'données d''entrée'!M26)","v":" "},{"$f":"IFERROR(IF(OR('données d''entrée'!N26<>0,AND('données d''entrée'!N26=0,N24-$R$8>=0)),'données d''entrée'!N26,\"\"),\"\")","v":""},1,0,null,null,null,null,null,null,null,null,null,null,null,null,null,null,null,null,null,null,null,null,null,null,null,null,null,null,null,null,null,null,null,null,null,null,null,null,null,null,null,null,null,null,null,null,null,null,null,null,null,null,null,null,null,null,null,null,null,null,null,null,null,null,null,null,null,null,null,null,null,null,null,null,null,1]
[null,{"$f":"IF('données d''entrée'!B27=0,\" \",'données d''entrée'!B27)","v":" "},{"$f":"IF('données d''entrée'!C27=0,\" \",'données d''entrée'!C27)","v":" "},{"$f":"IF('données d''entrée'!D27=0,\" \",'données d''entrée'!D27)","v":" "},{"$f":"IF('données d''entrée'!E27=0,0,'données d''entrée'!E27)","v":0},{"$f":"IF('données d''entrée'!F27=0,\" \",'données d''entrée'!F27)","v":" "},{"$f":"IF('données d''entrée'!G27=0,\" \",'données d''entrée'!G27)","v":" "},{"$f":"IF('données d''entrée'!H27=0,\" \",'données d''entrée'!H27)","v":" "},{"$f":"IF('données d''entrée'!I27=0,0,'données d''entrée'!I27)","v":0},{"$f":"IF('données d''entrée'!J27=0,\" \",'données d''entrée'!J27)","v":" "},"",{"$f":"IF('données d''entrée'!L27=0,\" \",'données d''entrée'!L27)","v":""},{"$f":"IFERROR(_xlfn.IFS(\nAND(OR(B25=$B$197,B25=$B$199,B25=$B$200,B25=$B$201,B25=$B$202,B25=$B$203,B25=$B$204,B25=$B$205,B25=$B$207),L25>100),100,\nAND(OR(B25=$B$197,B25=$B$199,B25=$B$200,B25=$B$201,B25=$B$202,B25=$B$203,B25=$B$204,B25=$B$205,B25=$B$207),L25<=100),L25,\nAND(OR(B25=$B$196,B25=$B$198),L25>90),90,\nAND(OR(B25=$B$196,B25=$B$198),L25<=90),L25,\nOR(B25=\"\",B25=$B$206),L25),0)","v":0},{"$f":"IF('données d''entrée'!M27=0,\" \",'données d''entrée'!M27)","v":" "},{"$f":"IFERROR(IF(OR('données d''entrée'!N27<>0,AND('données d''entrée'!N27=0,N25-$R$8>=0)),'données d''entrée'!N27,\"\"),\"\")","v":""},1,0,null,null,null,null,null,null,null,null,null,null,null,null,null,null,null,null,null,null,null,null,null,null,null,null,null,null,null,null,null,null,null,null,null,null,null,null,null,null,null,null,null,null,null,null,null,null,null,null,null,null,null,null,null,null,null,null,null,null,null,null,null,null,null,null,null,null,null,null,null,null,null,null,null,1]
[null,{"$f":"IF('données d''entrée'!B28=0,\" \",'données d''entrée'!B28)","v":" "},{"$f":"IF('données d''entrée'!C28=0,\" \",'données d''entrée'!C28)","v":" "},{"$f":"IF('données d''entrée'!D28=0,\" \",'données d''entrée'!D28)","v":" "},{"$f":"IF('données d''entrée'!E28=0,0,'données d''entrée'!E28)","v":0},{"$f":"IF('données d''entrée'!F28=0,\" \",'données d''entrée'!F28)","v":" "},{"$f":"IF('données d''entrée'!G28=0,\" \",'données d''entrée'!G28)","v":" "},{"$f":"IF('données d''entrée'!H28=0,\" \",'données d''entrée'!H28)","v":" "},{"$f":"IF('données d''entrée'!I28=0,0,'données d''entrée'!I28)","v":0},{"$f":"IF('données d''entrée'!J28=0,\" \",'données d''entrée'!J28)","v":" "},"",{"$f":"IF('données d''entrée'!L28=0,\" \",'données d''entrée'!L28)","v":""},{"$f":"IFERROR(_xlfn.IFS(\nAND(OR(B26=$B$197,B26=$B$199,B26=$B$200,B26=$B$201,B26=$B$202,B26=$B$203,B26=$B$204,B26=$B$205,B26=$B$207),L26>100),100,\nAND(OR(B26=$B$197,B26=$B$199,B26=$B$200,B26=$B$201,B26=$B$202,B26=$B$203,B26=$B$204,B26=$B$205,B26=$B$207),L26<=100),L26,\nAND(OR(B26=$B$196,B26=$B$198),L26>90),90,\nAND(OR(B26=$B$196,B26=$B$198),L26<=90),L26,\nOR(B26=\"\",B26=$B$206),L26),0)","v":0},{"$f":"IF('données d''entrée'!M28=0,\" \",'données d''entrée'!M28)","v":" "},{"$f":"IFERROR(IF(OR('données d''entrée'!N28<>0,AND('données d''entrée'!N28=0,N26-$R$8>=0)),'données d''entrée'!N28,\"\"),\"\")","v":""},1,0,null,null,null,null,null,null,null,null,null,null,null,null,null,null,null,null,null,null,null,null,null,null,null,null,null,null,null,null,null,null,null,null,null,null,null,null,null,null,null,null,null,null,null,null,null,null,null,null,null,null,null,null,null,null,null,null,null,null,null,null,null,null,null,null,null,null,null,null,null,null,null,null,null,1]
[null,{"$f":"IF('données d''entrée'!B29=0,\" \",'données d''entrée'!B29)","v":" "},{"$f":"IF('données d''entrée'!C29=0,\" \",'données d''entrée'!C29)","v":" "},{"$f":"IF('données d''entrée'!D29=0,\" \",'données d''entrée'!D29)","v":" "},{"$f":"IF('données d''entrée'!E29=0,0,'données d''entrée'!E29)","v":0},{"$f":"IF('données d''entrée'!F29=0,\" \",'données d''entrée'!F29)","v":" "},{"$f":"IF('données d''entrée'!G29=0,\" \",'données d''entrée'!G29)","v":" "},{"$f":"IF('données d''entrée'!H29=0,\" \",'données d''entrée'!H29)","v":" "},{"$f":"IF('données d''entrée'!I29=0,0,'données d''entrée'!I29)","v":0},{"$f":"IF('données d''entrée'!J29=0,\" \",'données d''entrée'!J29)","v":" "},"",{"$f":"IF('données d''entrée'!L29=0,\" \",'données d''entrée'!L29)","v":""},{"$f":"IFERROR(_xlfn.IFS(\nAND(OR(B27=$B$197,B27=$B$199,B27=$B$200,B27=$B$201,B27=$B$202,B27=$B$203,B27=$B$204,B27=$B$205,B27=$B$207),L27>100),100,\nAND(OR(B27=$B$197,B27=$B$199,B27=$B$200,B27=$B$201,B27=$B$202,B27=$B$203,B27=$B$204,B27=$B$205,B27=$B$207),L27<=100),L27,\nAND(OR(B27=$B$196,B27=$B$198),L27>90),90,\nAND(OR(B27=$B$196,B27=$B$198),L27<=90),L27,\nOR(B27=\"\",B27=$B$206),L27),0)","v":0},{"$f":"IF('données d''entrée'!M29=0,\" \",'données d''entrée'!M29)","v":" "},{"$f":"IFERROR(IF(OR('données d''entrée'!N29<>0,AND('données d''entrée'!N29=0,N27-$R$8>=0)),'données d''entrée'!N29,\"\"),\"\")","v":""},1,0,null,null,null,null,null,null,null,null,null,null,null,null,null,null,null,null,null,null,null,null,null,null,null,null,null,null,null,null,null,null,null,null,null,null,null,null,null,null,null,null,null,null,null,null,null,null,null,null,null,null,null,null,null,null,null,null,null,null,null,null,null,null,null,null,null,null,null,null,null,null,null,null,null,{"$f":"SUM(CM8:CM26)+1","v":20}]
[null,{"$f":"IF('données d''entrée'!B30=0,\" \",'données d''entrée'!B30)","v":" "},{"$f":"IF('données d''entrée'!C30=0,\" \",'données d''entrée'!C30)","v":" "},{"$f":"IF('données d''entrée'!D30=0,\" \",'données d''entrée'!D30)","v":" "},{"$f":"IF('données d''entrée'!E30=0,0,'données d''entrée'!E30)","v":0},{"$f":"IF('données d''entrée'!F30=0,\" \",'données d''entrée'!F30)","v":" "},{"$f":"IF('données d''entrée'!G30=0,\" \",'données d''entrée'!G30)","v":" "},{"$f":"IF('données d''entrée'!H30=0,\" \",'données d''entrée'!H30)","v":" "},{"$f":"IF('données d''entrée'!I30=0,0,'données d''entrée'!I30)","v":0},{"$f":"IF('données d''entrée'!J30=0,\" \",'données d''entrée'!J30)","v":" "},"",{"$f":"IF('données d''entrée'!L30=0,\" \",'données d''entrée'!L30)","v":""},{"$f":"IFERROR(_xlfn.IFS(\nAND(OR(B28=$B$197,B28=$B$199,B28=$B$200,B28=$B$201,B28=$B$202,B28=$B$203,B28=$B$204,B28=$B$205,B28=$B$207),L28>100),100,\nAND(OR(B28=$B$197,B28=$B$199,B28=$B$200,B28=$B$201,B28=$B$202,B28=$B$203,B28=$B$204,B28=$B$205,B28=$B$207),L28<=100),L28,\nAND(OR(B28=$B$196,B28=$B$198),L28>90),90,\nAND(OR(B28=$B$196,B28=$B$198),L28<=90),L28,\nOR(B28=\"\",B28=$B$206),L28),0)","v":0},{"$f":"IF('données d''entrée'!M30=0,\" \",'données d''entrée'!M30)","v":" "},{"$f":"IFERROR(IF(OR('données d''entrée'!N30<>0,AND('données d''entrée'!N30=0,N28-$R$8>=0)),'données d''entrée'!N30,\"\"),\"\")","v":""},1,0]
[null,{"$f":"IF('données d''entrée'!B31=0,\" \",'données d''entrée'!B31)","v":" "},{"$f":"IF('données d''entrée'!C31=0,\" \",'données d''entrée'!C31)","v":" "},{"$f":"IF('données d''entrée'!D31=0,\" \",'données d''entrée'!D31)","v":" "},{"$f":"IF('données d''entrée'!E31=0,0,'données d''entrée'!E31)","v":0},{"$f":"IF('données d''entrée'!F31=0,\" \",'données d''entrée'!F31)","v":" "},{"$f":"IF('données d''entrée'!G31=0,\" \",'données d''entrée'!G31)","v":" "},{"$f":"IF('données d''entrée'!H31=0,\" \",'données d''entrée'!H31)","v":" "},{"$f":"IF('données d''entrée'!I31=0,0,'données d''entrée'!I31)","v":0},{"$f":"IF('données d''entrée'!J31=0,\" \",'données d''entrée'!J31)","v":" "},"",{"$f":"IF('données d''entrée'!L31=0,\" \",'données d''entrée'!L31)","v":""},{"$f":"IFERROR(_xlfn.IFS(\nAND(OR(B29=$B$197,B29=$B$199,B29=$B$200,B29=$B$201,B29=$B$202,B29=$B$203,B29=$B$204,B29=$B$205,B29=$B$207),L29>100),100,\nAND(OR(B29=$B$197,B29=$B$199,B29=$B$200,B29=$B$201,B29=$B$202,B29=$B$203,B29=$B$204,B29=$B$205,B29=$B$207),L29<=100),L29,\nAND(OR(B29=$B$196,B29=$B$198),L29>90),90,\nAND(OR(B29=$B$196,B29=$B$198),L29<=90),L29,\nOR(B29=\"\",B29=$B$206),L29),0)","v":0},{"$f":"IF('données d''entrée'!M31=0,\" \",'données d''entrée'!M31)","v":" "},{"$f":"IFERROR(IF(OR('données d''entrée'!N31<>0,AND('données d''entrée'!N31=0,N29-$R$8>=0)),'données d''entrée'!N31,\"\"),\"\")","v":""},1,0]
[null,{"$f":"IF('données d''entrée'!B32=0,\" \",'données d''entrée'!B32)","v":" "},{"$f":"IF('données d''entrée'!C32=0,\" \",'données d''entrée'!C32)","v":" "},{"$f":"IF('données d''entrée'!D32=0,\" \",'données d''entrée'!D32)","v":" "},{"$f":"IF('données d''entrée'!E32=0,0,'données d''entrée'!E32)","v":0},{"$f":"IF('données d''entrée'!F32=0,\" \",'données d''entrée'!F32)","v":" "},{"$f":"IF('données d''entrée'!G32=0,\" \",'données d''entrée'!G32)","v":" "},{"$f":"IF('données d''entrée'!H32=0,\" \",'données d''entrée'!H32)","v":" "},{"$f":"IF('données d''entrée'!I32=0,0,'données d''entrée'!I32)","v":0},{"$f":"IF('données d''entrée'!J32=0,\" \",'données d''entrée'!J32)","v":" "},"",{"$f":"IF('données d''entrée'!L32=0,\" \",'données d''entrée'!L32)","v":""},{"$f":"IFERROR(_xlfn.IFS(\nAND(OR(B30=$B$197,B30=$B$199,B30=$B$200,B30=$B$201,B30=$B$202,B30=$B$203,B30=$B$204,B30=$B$205,B30=$B$207),L30>100),100,\nAND(OR(B30=$B$197,B30=$B$199,B30=$B$200,B30=$B$201,B30=$B$202,B30=$B$203,B30=$B$204,B30=$B$205,B30=$B$207),L30<=100),L30,\nAND(OR(B30=$B$196,B30=$B$198),L30>90),90,\nAND(OR(B30=$B$196,B30=$B$198),L30<=90),L30,\nOR(B30=\"\",B30=$B$206),L30),0)","v":0},{"$f":"IF('données d''entrée'!M32=0,\" \",'données d''entrée'!M32)","v":" "},{"$f":"IFERROR(IF(OR('données d''entrée'!N32<>0,AND('données d''entrée'!N32=0,N30-$R$8>=0)),'données d''entrée'!N32,\"\"),\"\")","v":""},1,0]
[null,{"$f":"IF('données d''entrée'!B33=0,\" \",'données d''entrée'!B33)","v":" "},{"$f":"IF('données d''entrée'!C33=0,\" \",'données d''entrée'!C33)","v":" "},{"$f":"IF('données d''entrée'!D33=0,\" \",'données d''entrée'!D33)","v":" "},{"$f":"IF('données d''entrée'!E33=0,0,'données d''entrée'!E33)","v":0},{"$f":"IF('données d''entrée'!F33=0,\" \",'données d''entrée'!F33)","v":" "},{"$f":"IF('données d''entrée'!G33=0,\" \",'données d''entrée'!G33)","v":" "},{"$f":"IF('données d''entrée'!H33=0,\" \",'données d''entrée'!H33)","v":" "},{"$f":"IF('données d''entrée'!I33=0,0,'données d''entrée'!I33)","v":0},{"$f":"IF('données d''entrée'!J33=0,\" \",'données d''entrée'!J33)","v":" "},"",{"$f":"IF('données d''entrée'!L33=0,\" \",'données d''entrée'!L33)","v":""},{"$f":"IFERROR(_xlfn.IFS(\nAND(OR(B31=$B$197,B31=$B$199,B31=$B$200,B31=$B$201,B31=$B$202,B31=$B$203,B31=$B$204,B31=$B$205,B31=$B$207),L31>100),100,\nAND(OR(B31=$B$197,B31=$B$199,B31=$B$200,B31=$B$201,B31=$B$202,B31=$B$203,B31=$B$204,B31=$B$205,B31=$B$207),L31<=100),L31,\nAND(OR(B31=$B$196,B31=$B$198),L31>90),90,\nAND(OR(B31=$B$196,B31=$B$198),L31<=90),L31,\nOR(B31=\"\",B31=$B$206),L31),0)","v":0},{"$f":"IF('données d''entrée'!M33=0,\" \",'données d''entrée'!M33)","v":" "},{"$f":"IFERROR(IF(OR('données d''entrée'!N33<>0,AND('données d''entrée'!N33=0,N31-$R$8>=0)),'données d''entrée'!N33,\"\"),\"\")","v":""},1,0]
[null,{"$f":"IF('données d''entrée'!B34=0,\" \",'données d''entrée'!B34)","v":" "},{"$f":"IF('données d''entrée'!C34=0,\" \",'données d''entrée'!C34)","v":" "},{"$f":"IF('données d''entrée'!D34=0,\" \",'données d''entrée'!D34)","v":" "},{"$f":"IF('données d''entrée'!E34=0,0,'données d''entrée'!E34)","v":0},{"$f":"IF('données d''entrée'!F34=0,\" \",'données d''entrée'!F34)","v":" "},{"$f":"IF('données d''entrée'!G34=0,\" \",'données d''entrée'!G34)","v":" "},{"$f":"IF('données d''entrée'!H34=0,\" \",'données d''entrée'!H34)","v":" "},{"$f":"IF('données d''entrée'!I34=0,0,'données d''entrée'!I34)","v":0},{"$f":"IF('données d''entrée'!J34=0,\" \",'données d''entrée'!J34)","v":" "},"",{"$f":"IF('données d''entrée'!L34=0,\" \",'données d''entrée'!L34)","v":""},{"$f":"IFERROR(_xlfn.IFS(\nAND(OR(B32=$B$197,B32=$B$199,B32=$B$200,B32=$B$201,B32=$B$202,B32=$B$203,B32=$B$204,B32=$B$205,B32=$B$207),L32>100),100,\nAND(OR(B32=$B$197,B32=$B$199,B32=$B$200,B32=$B$201,B32=$B$202,B32=$B$203,B32=$B$204,B32=$B$205,B32=$B$207),L32<=100),L32,\nAND(OR(B32=$B$196,B32=$B$198),L32>90),90,\nAND(OR(B32=$B$196,B32=$B$198),L32<=90),L32,\nOR(B32=\"\",B32=$B$206),L32),0)","v":0},{"$f":"IF('données d''entrée'!M34=0,\" \",'données d''entrée'!M34)","v":" "},{"$f":"IFERROR(IF(OR('données d''entrée'!N34<>0,AND('données d''entrée'!N34=0,N32-$R$8>=0)),'données d''entrée'!N34,\"\"),\"\")","v":""},1,0]
[null,{"$f":"IF('données d''entrée'!B35=0,\" \",'données d''entrée'!B35)","v":" "},{"$f":"IF('données d''entrée'!C35=0,\" \",'données d''entrée'!C35)","v":" "},{"$f":"IF('données d''entrée'!D35=0,\" \",'données d''entrée'!D35)","v":" "},{"$f":"IF('données d''entrée'!E35=0,0,'données d''entrée'!E35)","v":0},{"$f":"IF('données d''entrée'!F35=0,\" \",'données d''entrée'!F35)","v":" "},{"$f":"IF('données d''entrée'!G35=0,\" \",'données d''entrée'!G35)","v":" "},{"$f":"IF('données d''entrée'!H35=0,\" \",'données d''entrée'!H35)","v":" "},{"$f":"IF('données d''entrée'!I35=0,0,'données d''entrée'!I35)","v":0},{"$f":"IF('données d''entrée'!J35=0,\" \",'données d''entrée'!J35)","v":" "},"",{"$f":"IF('données d''entrée'!L35=0,\" \",'données d''entrée'!L35)","v":""},{"$f":"IFERROR(_xlfn.IFS(\nAND(OR(B33=$B$197,B33=$B$199,B33=$B$200,B33=$B$201,B33=$B$202,B33=$B$203,B33=$B$204,B33=$B$205,B33=$B$207),L33>100),100,\nAND(OR(B33=$B$197,B33=$B$199,B33=$B$200,B33=$B$201,B33=$B$202,B33=$B$203,B33=$B$204,B33=$B$205,B33=$B$207),L33<=100),L33,\nAND(OR(B33=$B$196,B33=$B$198),L33>90),90,\nAND(OR(B33=$B$196,B33=$B$198),L33<=90),L33,\nOR(B33=\"\",B33=$B$206),L33),0)","v":0},{"$f":"IF('données d''entrée'!M35=0,\" \",'données d''entrée'!M35)","v":" "},{"$f":"IFERROR(IF(OR('données d''entrée'!N35<>0,AND('données d''entrée'!N35=0,N33-$R$8>=0)),'données d''entrée'!N35,\"\"),\"\")","v":""},1,0]
[null,null,null,null,{"$f":"SUM(E9:E33)","v":0},null,{"$f":"SUM(G9:G33)","v":0},{"$f":"SUM(H9:H33)","v":0},0,{"$f":"IFERROR(AVERAGE(J9:J33),0)","v":0},{"$f":"IFERROR(SUM(K9:K33),0)","v":0},{"$f":"IFERROR(AVERAGE(L9:L33),\"\")","v":""},null,null,{"$f":"(AVERAGE(O9:O33))","v":{"$error":"#DIV/0!"}}]
[null,null,null,null,null,null,null,null,null,null,null,null,null,null,null,null,"10/ CHIFFRAGE SCENARIO DE REFERENCE"]
[null,"2/ SCENARIO DE REFERENCE",null,null,null,null,null,null,null,null,null,null,null,null,null,null,"Caractéristiques de l'installation dans le Scénario de Référence"]
[null,"Caractéristiques de l'installation dans le Scénario de Référence",null,null,null,null,null,null,null,null,null,null,null,null,null,null,"Bâtiments",{"$f":"IF(OR(W8=\"oui\",W7=\"oui\"),\"investissement HTVA\",\"investissement TTC\")","v":"investissement TTC"},{"$f":"IF(OR(W8=\"oui\",W7=\"oui\"),\"Coût unitaire de l'énergie (€/MWh HTVA)\",\"Coût unitaire de l'énergie (€/MWh TTC)\")","v":"Coût unitaire de l'énergie (€/MWh TTC)"},{"$f":"IF(OR(W8=\"oui\",W7=\"oui\"),\"Coût de l'énergie annuelle P1 (€ HTVA)\",\"Coût de l'énergie annuelle P1 (€ TTC)\")","v":"Coût de l'énergie annuelle P1 (€ TTC)"},{"$f":"IF(OR(W8=\"oui\",W7=\"oui\"),\"Coût de maintenance annuelle P2 (€ HTVA)\",\"Coût de maintenance annuelle P2 (€ TTC)\")","v":"Coût de maintenance annuelle P2 (€ TTC)"},{"$f":"IF(OR(W8=\"oui\",W7=\"oui\"),\"GER P3 (€ HTVA)\",\"GER P3 (€ TTC)\")","v":"GER P3 (€ TTC)"},{"$f":"IF(OR(W8=\"oui\",W7=\"oui\"),\"Coût des annuités P4 (€ HTVA)\",\"Coût des annuités P4 (€ TTC)\")","v":"Coût des annuités P4 (€ TTC)"},"durée amortissement",{"$f":"IF(OR(W8=\"oui\",W7=\"oui\"),\"Dépenses d'exploitation totales référence (€ HTVA)\",\"Dépenses d'exploitation totales référence(€ TTC)\")","v":"Dépenses d'exploitation totales référence(€ TTC)"},{"$f":"IF(OR(W8=\"oui\",W7=\"oui\"),\"Coût par MWh (€ HTVA)\",\"Coût par MWh (€ TTC)\")","v":"Coût par MWh (€ TTC)"}]
[null,"Bâtiment(s)","Nature des travaux envisagés sur la production de chauffage","énergie de référence choisie","économies d'énergie (% de réduction)","puissance de référence (kW)","consommation moyenne sur 3 ans\n( chauffage + ECS ; MWh PCI)","Consommation d'ECS (si non connue, 0)","Rendement de production","besoin utile MWh",null,null,null,null,null,null,{"$f":"B39","v":" "},{"$f":"IFERROR(IF(F39=0,0,IF($C39=\"\",0,IF($F39=0,0,IF(OR($W$8=\"oui\",$W$7=\"oui\"),IF(N9-$R$8>=0,1,O9)*IF(AND($F39>9,$F39<151),0.57*$F39^2+76*$F39+2500,IF(AND($F39>150,$F39<951),56.1*$F39+18300,IF(AND($F39>950,$F39<14501),34.3*$F39+39000,IF($F39>14500,20.3*$F39+242000,\"\")))),O9*IF(AND($F39>9,$F39<151),0.57*$F39^2+76*$F39+2500,IF(AND($F39>150,$F39<951),56.1*$F39+18300,IF(AND($F39>950,$F39<14501),34.3*$F39+39000,IF($F39>14500,20.3*$F39+242000,\"\"))))*(1+$W$9)))))*1.3,0)","v":0},{"$f":"IF(OR(D39=\"à définir\",D39=\"\"),\"\",IF(OR($W$8=\"oui\",$W$7=\"oui\"),IF(D39=\"pac\",VLOOKUP(\"électricité\",$Y$7:$Z$12,2),VLOOKUP(D39,$Y$7:$Z$12,2)),IF(OR(D39=\"granulé\",D39=\"Bois déchiqueté\"),VLOOKUP(D39,$Y$7:$Z$12,2)*1.1,IF(D39=\"pac\",VLOOKUP(\"électricité\",$Y$7:$Z$12,2)*1.2,VLOOKUP(D39,$Y$7:$Z$12,2)*1.2))))","v":""},{"$f":"IF(S38=\"\",0,S38*G39)","v":0},{"$f":"IF(F39=\"\",0,IF(OR($W$8=\"oui\",$W$7=\"oui\"),IF(AND(F39>1,F39<8.99),250,IF(AND(F39>9,F39<96),0.18*F39^2-7.6*F39+300,IF(AND(F39>95,F39<951),6.6*F39+530,IF(AND(F39>950,F39<3501),F39+5800,IF(F39>3500,3.2*F39-1900,\"\"))))),IF(AND(F39>1,F39<8.99),250,IF(AND(F39>9,F39<96),0.18*F39^2-7.6*F39+300,IF(AND(F39>95,F39<951),6.6*F39+530,IF(AND(F39>950,F39<3501),F39+5800,IF(F39>3500,3.2*F39-1900,\"\")))))*(1+$W$9)))*1.3","v":0},{"$f":"0.01*R38","v":0},{"$f":"IFERROR(IF(X38=\"\",-PMT($AA$83,$Z$83,R38),-PMT($AA$83,X38,R38)),0)","v":0},null,{"$f":"W38+V38+U38+T38","v":0},{"$f":"IFERROR(IF(J39=0,0,Y38/J39),0)","v":0}]
[null,{"$f":"IF(D9=0,\"\",D9)","v":" "},null,null,{"$f":"IF('Synthèse pour trame'!$W$84<>0,'Synthèse pour trame'!$W$84,IF('Synthèse pour trame'!$W$80=\"Non\",0,'Synthèse pour trame'!$W$81))","v":0},null,{"$f":"IFERROR(IF(H9=0,0,(1-E39)*H9*J9/I39),\"\")","v":""},{"$f":"IFERROR(IF(K9=0,0,I9*J9/I39*(1-E39)),0)","v":0},{"$f":"IF(D39=\"PAC\",300%,IF(ISBLANK(D39)=TRUE,\"\",90%))","v":""},{"$f":"IFERROR(IF(K9=0,\"\",(G39)*I39),\"\")","v":""},null,null,null,null,null,null,{"$f":"B40","v":" "},{"$f":"IFERROR(IF(F40=0,0,IF($C40=\"\",0,IF($F40=0,0,IF(OR($W$8=\"oui\",$W$7=\"oui\"),IF(N10-$R$8>=0,1,O10)*IF(AND($F40>9,$F40<151),0.57*$F40^2+76*$F40+2500,IF(AND($F40>150,$F40<951),56.1*$F40+18300,IF(AND($F40>950,$F40<14501),34.3*$F40+39000,IF($F40>14500,20.3*$F40+242000,\"\")))),O10*IF(AND($F40>9,$F40<151),0.57*$F40^2+76*$F40+2500,IF(AND($F40>150,$F40<951),56.1*$F40+18300,IF(AND($F40>950,$F40<14501),34.3*$F40+39000,IF($F40>14500,20.3*$F40+242000,\"\"))))*(1+$W$9)))))*1.3,0)","v":0},"",{"$f":"IF(S39=\"\",0,S39*G40)","v":0},{"$f":"IF(F40=\"\",0,IF(OR($W$8=\"oui\",$W$7=\"oui\"),IF(AND(F40>1,F40<8.99),250,IF(AND(F40>9,F40<96),0.18*F40^2-7.6*F40+300,IF(AND(F40>95,F40<951),6.6*F40+530,IF(AND(F40>950,F40<3501),F40+5800,IF(F40>3500,3.2*F40-1900,\"\"))))),IF(AND(F40>1,F40<8.99),250,IF(AND(F40>9,F40<96),0.18*F40^2-7.6*F40+300,IF(AND(F40>95,F40<951),6.6*F40+530,IF(AND(F40>950,F40<3501),F40+5800,IF(F40>3500,3.2*F40-1900,\"\")))))*(1+$W$9)))*1.3","v":0},{"$f":"0.01*R39","v":0},0,null,{"$f":"W39+V39+U39+T39","v":0},{"$f":"IFERROR(IF(J40=0,0,Y39/J40),0)","v":0}]
[null," ",null,null,{"$f":"IF('Synthèse pour trame'!$W$84<>0,'Synthèse pour trame'!$W$84,IF('Synthèse pour trame'!$W$80=\"Non\",0,'Synthèse pour trame'!$W$81))","v":0},null,{"$f":"IFERROR(IF(H10=0,0,(1-E40)*H10*J10/I40),\"\")","v":""},{"$f":"IFERROR(IF(K10=0,0,I10*J10/I40*(1-E40)),0)","v":0},{"$f":"IF(D40=\"PAC\",300%,IF(ISBLANK(D40)=TRUE,\"\",90%))","v":""},{"$f":"IFERROR(IF(K10=0,\"\",(G40)*I40),\"\")","v":""},null,null,null,null,null,null," ",0,"",0,0,0,0,null,0,0]
[null," ",null,null,{"$f":"IF('Synthèse pour trame'!$W$84<>0,'Synthèse pour trame'!$W$84,IF('Synthèse pour trame'!$W$80=\"Non\",0,'Synthèse pour trame'!$W$81))","v":0},null,"",0,"","",null,null,null,null,null,null," ",0,"",0,0,0,0,null,0,0]
[null," ",null,null,{"$f":"IF('Synthèse pour trame'!$W$84<>0,'Synthèse pour trame'!$W$84,IF('Synthèse pour trame'!$W$80=\"Non\",0,'Synthèse pour trame'!$W$81))","v":0},null,"",0,"","",null,null,null,null,null,null," ",0,"",0,0,0,0,null,0,0]
[null," ",null,null,{"$f":"IF('Synthèse pour trame'!$W$84<>0,'Synthèse pour trame'!$W$84,IF('Synthèse pour trame'!$W$80=\"Non\",0,'Synthèse pour trame'!$W$81))","v":0},null,"",0,"","",null,null,null,null,null,null," ",0,"",0,0,0,0,null,0,0]
[null," ",null,null,{"$f":"IF('Synthèse pour trame'!$W$84<>0,'Synthèse pour trame'!$W$84,IF('Synthèse pour trame'!$W$80=\"Non\",0,'Synthèse pour trame'!$W$81))","v":0},null,"",0,"","",null,null,null,null,null,null," ",0,"",0,0,0,0,null,0,0]
[null," ",null,null,{"$f":"IF('Synthèse pour trame'!$W$84<>0,'Synthèse pour trame'!$W$84,IF('Synthèse pour trame'!$W$80=\"Non\",0,'Synthèse pour trame'!$W$81))","v":0},null,"",0,"","",null,null,null,null,null,null," ",0,"",0,0,0,0,null,0,0]
[null," ",null,null,{"$f":"IF('Synthèse pour trame'!$W$84<>0,'Synthèse pour trame'!$W$84,IF('Synthèse pour trame'!$W$80=\"Non\",0,'Synthèse pour trame'!$W$81))","v":0},null,"",0,"","",null,null,null,null,null,null," ",0,"",0,0,0,0,null,0,0]
[null," ",null,null,{"$f":"IF('Synthèse pour trame'!$W$84<>0,'Synthèse pour trame'!$W$84,IF('Synthèse pour trame'!$W$80=\"Non\",0,'Synthèse pour trame'!$W$81))","v":0},null,"",0,"","",null,null,null,null,null,null," ",0,"",0,0,0,0,null,0,0]
[null," ",null,null,{"$f":"IF('Synthèse pour trame'!$W$84<>0,'Synthèse pour trame'!$W$84,IF('Synthèse pour trame'!$W$80=\"Non\",0,'Synthèse pour trame'!$W$81))","v":0},null,"",0,"","",null,null,null,null,null,null," ",0,"",0,0,0,0,null,0,0]
[null," ",null,null,{"$f":"IF('Synthèse pour trame'!$W$84<>0,'Synthèse pour trame'!$W$84,IF('Synthèse pour trame'!$W$80=\"Non\",0,'Synthèse pour trame'!$W$81))","v":0},null,"",0,"","",null,null,null,null,null,null," ",0,"",0,0,0,0,null,0,0]
[null," ",null,null,{"$f":"IF('Synthèse pour trame'!$W$84<>0,'Synthèse pour trame'!$W$84,IF('Synthèse pour trame'!$W$80=\"Non\",0,'Synthèse pour trame'!$W$81))","v":0},null,"",0,"","",null,null,null,null,null,null," ",0,"",0,0,0,0,null,0,0]
[null," ",null,null,{"$f":"IF('Synthèse pour trame'!$W$84<>0,'Synthèse pour trame'!$W$84,IF('Synthèse pour trame'!$W$80=\"Non\",0,'Synthèse pour trame'!$W$81))","v":0},null,"",0,"","",null,null,null,null,null,null," ",0,"",0,0,0,0,null,0,0]
[null," ",null,null,{"$f":"IF('Synthèse pour trame'!$W$84<>0,'Synthèse pour trame'!$W$84,IF('Synthèse pour trame'!$W$80=\"Non\",0,'Synthèse pour trame'!$W$81))","v":0},null,"",0,"","",null,null,null,null,null,null," ",0,"",0,0,0,0,null,0,0]
[null," ",null,null,{"$f":"IF('Synthèse pour trame'!$W$84<>0,'Synthèse pour trame'!$W$84,IF('Synthèse pour trame'!$W$80=\"Non\",0,'Synthèse pour trame'!$W$81))","v":0},null,"",0,"","",null,null,null,null,null,null," ",0,"",0,0,0,0,null,0,0]
[null," ",null,null,{"$f":"IF('Synthèse pour trame'!$W$84<>0,'Synthèse pour trame'!$W$84,IF('Synthèse pour trame'!$W$80=\"Non\",0,'Synthèse pour trame'!$W$81))","v":0},null,"",0,"","",null,null,null,null,null,null," ",0,"",0,0,0,0,null,0,0]
[null," ",null,null,{"$f":"IF('Synthèse pour trame'!$W$84<>0,'Synthèse pour trame'!$W$84,IF('Synthèse pour trame'!$W$80=\"Non\",0,'Synthèse pour trame'!$W$81))","v":0},null,"",0,"","",null,null,null,null,null,null," ",0,"",0,0,0,0,null,0,0]
[null," ",null,null,{"$f":"IF('Synthèse pour trame'!$W$84<>0,'Synthèse pour trame'!$W$84,IF('Synthèse pour trame'!$W$80=\"Non\",0,'Synthèse pour trame'!$W$81))","v":0},null,"",0,"","",null,null,null,null,null,null," ",0,"",0,0,0,0,null,0,0]
[null," ",null,null,{"$f":"IF('Synthèse pour trame'!$W$84<>0,'Synthèse pour trame'!$W$84,IF('Synthèse pour trame'!$W$80=\"Non\",0,'Synthèse pour trame'!$W$81))","v":0},null,"",0,"","",null,null,null,null,null,null," ",0,"",0,0,0,0,null,0,0]
[null," ",null,null,{"$f":"IF('Synthèse pour trame'!$W$84<>0,'Synthèse pour trame'!$W$84,IF('Synthèse pour trame'!$W$80=\"Non\",0,'Synthèse pour trame'!$W$81))","v":0},null,"",0,"","",null,null,null,null,null,null," ",0,"",0,0,0,0,null,0,0]
[null," ",null,null,{"$f":"IF('Synthèse pour trame'!$W$84<>0,'Synthèse pour trame'!$W$84,IF('Synthèse pour trame'!$W$80=\"Non\",0,'Synthèse pour trame'!$W$81))","v":0},null,"",0,"","",null,null,null,null,null,null," ",0,"",0,0,0,0,null,0,{"$f":"IFERROR(IF(J60=0,0,Y59/J60),0)","v":0}]
[null," ",null,null,{"$f":"IF('Synthèse pour trame'!$W$84<>0,'Synthèse pour trame'!$W$84,IF('Synthèse pour trame'!$W$80=\"Non\",0,'Synthèse pour trame'!$W$81))","v":0},null,"",0,"","",null,null,null,null,null,null," ",0,"",0,0,0,0,null,0,0]
[null," ",null,null,{"$f":"IF('Synthèse pour trame'!$W$84<>0,'Synthèse pour trame'!$W$84,IF('Synthèse pour trame'!$W$80=\"Non\",0,'Synthèse pour trame'!$W$81))","v":0},null,"",0,"","",null,null,null,null,null,null," ",0,"",0,0,0,0,null,0,0]
[null," ",null,null,{"$f":"IF('Synthèse pour trame'!$W$84<>0,'Synthèse pour trame'!$W$84,IF('Synthèse pour trame'!$W$80=\"Non\",0,'Synthèse pour trame'!$W$81))","v":0},null,"",0,"","",null,null,null,null,null,null," ",0,"",0,0,0,0,null,0,0]
[null," ",null,null,{"$f":"IF('Synthèse pour trame'!$W$84<>0,'Synthèse pour trame'!$W$84,IF('Synthèse pour trame'!$W$80=\"Non\",0,'Synthèse pour trame'!$W$81))","v":0},null,"",0,"","",null,null,null,null,null,null,"Total",{"$f":"SUM(R38:R62)","v":0},null,{"$f":"SUM(T38:T62)","v":0},{"$f":"SUM(U38:U62)","v":0},{"$f":"SUM(V38:V62)","v":0},{"$f":"SUM(W38:W62)","v":0},null,{"$f":"SUM(Y38:Y62)","v":0}]
[null,null,null,null,"Total",{"$f":"SUM(F39:F63)","v":0},{"$f":"SUM(G39:G63)","v":0},{"$f":"SUM(H39:H63)","v":0},{"$f":"SUMPRODUCT(I39:I63,G39:G63)/G64","v":{"$error":"#DIV/0!"}},{"$f":"SUM(J39:J63)","v":0}]
[]
[null,null,null,null,null,null,null,null,null,null,null,null,null,null,null,null,"11/ CHIFFRAGE SCENARIO BOIS"]
[null,"3/ SCENARIO BOIS",null,null,null,null,null,null,null,null,null,null,null,null,null,null,"travaux à prévoir pour la solution Bois",null,null,null,null,null,{"$f":"IF(OR(W8=\"oui\",W7=\"oui\"),\"Détail des dépenses d'exploitation (€/MWh HTVA)\",\"Détail des dépenses d'exploitation (€/MWh TTC)\")","v":"Détail des dépenses d'exploitation (€/MWh TTC)"}]
[null,"Energie à fournir par bâtiment par la chaufferie bois ou le réseau",null,null,null,null,null,null,null,null,null,null,null,null,null,null,"postes de dépenses","caractéristiques",{"$f":"IF(OR(W8=\"oui\",W7=\"oui\"),\"investissement HTVA\",\"investissement TTC\")","v":"investissement TTC"},"taux subv.","solde",null,"MWh bois entrée chaufferie",null,null,null,null,{"$f":"C106","v":0}]
[null,"Bâtiment(s)","Nature des travaux envisagés sur la production de chauffage","puissance à fournir par la chaufferie bois ou la sous station (kW)","besoins utiles (MWh) sortie chaudière ou  livrés en sous station",null,null,null,null,null,null,null,null,null,null,null,"chaudière bois / puissance :",{"$f":"C99","v":0},null,{"$f":"U119","v":0},{"$f":"(1-T69)*S69","v":0},null,{"$f":"\"MWh fossile entrée chaufferie\"&IF(F114=\"Oui\",\"dont P1 géothermie\",\"\")","v":"MWh fossile entrée chaufferie"},null,null,null,null,{"$f":"C107+IF(F114=\"Oui\",F119,0)","v":0}]
[null,{"$f":"IF(D9=0,\"\",D9)","v":" "},null,{"$f":"IF(OR(I70=\"\",I70=0),F39,\"à préciser\")","v":0},{"$f":"IF(J39=\"\",0,IF(G39=\"\",0,J39))","v":0},null,null,null,null,null,null,null,null,null,null,null,"hydraulique et électricité en chaufferie",null,null,{"$f":"T69","v":0},0,null,"P1",null,null,null,null,{"$f":"SUM(AB71:AB72)","v":0}]
[null," ",null,{"$f":"IF(OR(I71=\"\",I71=0),F40,\"à préciser\")","v":0},0,null,null,null,null,null,null,null,null,null,null,null,"fumisterie",null,null,{"$f":"T69","v":0},0,null,"MWh bois entrée chaufferie - P1 bois",null,"coût du MWh bois :",null,{"$f":"IF(OR(C103=\"\",C103=\"à définir\"),\"définir le type de combustible en F40\",VLOOKUP(C103,Y7:Z12,2))","v":"définir le type de combustible en F40"},{"$f":"IF(OR(C103=\"\",C103=\"à définir\"),0,IF(OR($W$8=\"oui\",$W$7=\"oui\"),AB68*AA71,AB68*AA71*(1+0.1)))","v":0}]
[null," ",null,0,0,null,null,null,null,null,null,null,null,null,null,null,"traitement des fumées",null,null,{"$f":"T69","v":0},{"$f":"(1-T72)*S72","v":0},null,"MWh fossile entrée chaufferie - P1 appoint.",null,"coût du MWh appoint :",null,{"$f":"IF(C104=\"aucun\",\"\",IF(OR(C104=\"\",C104=\"à définir\"),\"définir le type de combustible en F41\",VLOOKUP(C104,Y7:Z12,2)))","v":"définir le type de combustible en F41"},{"$f":"IF(C104=\"aucun\",0,IF(OR(C104=\"\",C104=\"à définir\"),0,IF(OR($W$8=\"oui\",$W$7=\"oui\"),AB69*AA72,AB69*AA72*(1+$W$9))))","v":0}]
[null," ",null,0,0,null,null,null,null,null,null,null,null,null,null,null,"régulation",null,null,{"$f":"T69","v":0},{"$f":"(1-T73)*S73","v":0},null,"P2",null,null,null,null,{"$f":"SUM(AB74:AB77)","v":0}]
[null," ",null,0,0,null,null,null,null,null,null,null,null,null,null,null,"imprévus chaufferie bois",null,null,{"$f":"T70","v":0},{"$f":"(1-T74)*S74","v":0},null,"Electricité","% de la production",0.01,"coût du MWh électrique : ",{"$f":"Z8","v":200},{"$f":"IF(OR($W$8=\"oui\",$W$7=\"oui\"),S102*Y74*AA74,S102*Y74*AA74*(1+W9))","v":0}]
[null," ",null,0,0,null,null,null,null,null,null,null,null,null,null,null,"imprévus chaufferie bois - pour synthèse trame",null,{"$f":"IF('Synthèse pour trame'!W85<>0,V74*'Synthèse pour trame'!W85,0)","v":0},{"$f":"IF(S75<0,1,T69)","v":0},{"$f":"(1-T75)*S75","v":0},null,"Entretien courant premier niveau (interne)",null,{"$f":"IF(N102=0,0,(31*5*0.25)+(8*1.5)+(2*0.5)+(1*N102))","v":0},"heures","cout interne (45€/h)",{"$f":"Y75*45","v":0}]
[null," ",null,0,0,null,null,null,null,null,null,null,null,null,null,null,"Total équipements chaufferie bois",null,{"$f":"SUM(S69:S75)","v":0},null,{"$f":"SUM(U69:U75)","v":0},null,"contrat d'entretien maintenance",null,null,"ratio de coût de maintenance :",11,{"$f":"AA76*C99","v":0}]
[null," ",null,0,0,null,null,null,null,null,null,null,null,null,null,null,"trémie silo",null,null,{"$f":"T69","v":0},{"$f":"(1-T77)*S77","v":0},null,"Autres charges P2 (couplage)",null,null,null,null,{"$f":"IF(C114=\"Oui\",C119)+IF(F114=\"Oui\",F120)","v":0}]
[null," ",null,0,0,null,null,null,null,null,null,null,null,null,null,null,"voirie, vrd - surcout spécifique",null,0,{"$f":"T69","v":0},0,null,"P3",null,null,null,null,{"$f":"SUM(AB79:AB80)","v":0}]
[null," ",null,0,0,null,null,null,null,null,null,null,null,null,null,null,"génie civil et vrd classique",null,null,{"$f":"T69","v":0},0,null,"P3 gros entretien",null,0.01,null,null,{"$f":"IF(OR($W$8=\"oui\",$W$7=\"oui\"),Y79*(S76+S83+S85),Y79*(S76+S83+S85)*(1+W9))","v":0}]
[null," ",null,0,0,null,null,null,null,null,null,null,null,null,null,null,"Total batiment chaufferie bois",null,{"$f":"SUM(S77:S79)","v":0},null,{"$f":"SUM(U77:U79)","v":0},null,"Autres charges P3 (couplage)",null,null,null,null,{"$f":"IF(C114=\"Oui\",C120)+IF(F114=\"Oui\",F121)","v":0}]
[null," ",null,0,0,null,null,null,null,null,null,null,null,null,null,null,"chaudière d'appoint /                    puissance :",{"$f":"C100","v":0},{"$f":"R81*200","v":0},"non éligible",{"$f":"S81","v":0},null,"P4",null,null,"Durée de l'emprunt","Taux d'emprunt",{"$f":"SUM(AB82:AB83)","v":{"$error":"#NUM!"}}]
[null," ",null,0,0,null,null,null,null,null,null,null,null,null,null,null,"imprévus appoint",null,0,"non éligible",{"$f":"S82","v":0},null,"annuité lots techniques",null,"durée",null,null,{"$f":"-PMT(AA82,Z82,U76+U83+U85+U77)","v":{"$error":"#NUM!"}}]
[null," ",null,0,0,null,null,null,null,null,null,null,null,null,null,null,"Total appoint",null,{"$f":"SUM(S81:S82)","v":0},null,{"$f":"SUM(U81:U82)","v":0},null,"annuité lots gros œuvre",null,"durée",null,null,{"$f":"-PMT(AA83,Z83,U78+U79+U84+U86+U93)","v":{"$error":"#NUM!"}}]
[null," ",null,0,0,null,null,null,null,null,null,null,null,null,null,null,"réseau de chaleur /                           longueur : ",{"$f":"D190","v":0},{"$f":"F190","v":0},{"$f":"T69","v":0},{"$f":"IF(S84=0,0,(1-T84)*S84)","v":0}]
[null," ",null,0,0,null,null,null,null,null,null,null,null,null,null,null,"sous-stations /                                   nombre :",null,{"$f":"IF(R85=0,0,R85*13000+26*C98)","v":0},{"$f":"T70","v":0},{"$f":"IF(S85=0,0,(1-T85)*S85)","v":0}]
[null," ",null,0,0,null,null,null,null,null,null,null,null,null,null,null,"imprévus réseau",null,null,{"$f":"T71","v":0},0]
[null," ",null,0,0,null,null,null,null,null,null,null,null,null,null,null,"Total réseau",null,{"$f":"SUM(S84:S86)","v":0},null,{"$f":"SUM(U84:U86)","v":0},null,null,"ANALYSE DE SENSIBILITE"]
[null," ",null,0,0,null,null,null,null,null,null,null,null,null,null,null,"Total couplage(s)",{"$f":"IF(C114=\"Oui\",\"Solaire Thermique\",\"\")&\"/\"& IF(F114=\"Oui\",\"Géothermie\",\"\")","v":"/"},{"$f":"IF(C114=\"Oui\",C117)+IF(F114=\"Oui\",F117)","v":0},null,null,null,null,"Prix MWh cumac",{"$f":"'données d''entrée'!Q30","v":7.5}]
[null," ",null,0,0,null,null,null,null,null,null,null,null,null,null,null,"Total équipements (hors équipements secondaires)",null,{"$f":"S76+S80+S83+S87+S88","v":0},{"$f":"S89-U89","v":0},{"$f":"U76+U80+U83+U87","v":0},null,null,"Inflation maintenance :",{"$f":"IF('données d''entrée'!Q31=0,\" \",'données d''entrée'!Q31)","v":0.02}]
[null," ",null,0,0,null,null,null,null,null,null,null,null,null,null,null,null,null,null,null,null,null,null,"Inflation énergie bois :",{"$f":"IF('données d''entrée'!Q32=0,\" \",'données d''entrée'!Q32)","v":0.01}]
[null," ",null,0,0,null,null,null,null,null,null,null,null,null,null,null,"mision de maîtrise d'œuvre /                                   taux :",0.12,{"$f":"S89*R91","v":0},{"$f":"T69","v":0},{"$f":"(1-T91)*S91","v":0},null,null,"Inflation énergie électrique :",{"$f":"IF('données d''entrée'!Q33=0,\" \",'données d''entrée'!Q33)","v":0.04}]
[null," ",null,0,0,null,null,null,null,null,null,null,null,null,null,null,"imprévus étude et Moe",null,0,{"$f":"T69","v":0},0,null,null,"Inflation énergie fossile :",{"$f":"IF('données d''entrée'!Q34=0,\" \",'données d''entrée'!Q34)","v":0.03}]
[null," ",null,0,0,null,null,null,null,null,null,null,null,null,null,null,"total maitrise d'œuvre",{"$f":"S93/S89","v":{"$error":"#DIV/0!"}},{"$f":"SUM(S91:S92)","v":0},{"$f":"S93-U93","v":0},{"$f":"SUM(U91:U92)","v":0}]
[null," ",null,0,0]
[null,null,null,null,null,null,null,null,null,null,null,null,null,null,null,null,"coût Total  du projet",null,{"$f":"S93+S89","v":0},{"$f":"S95-U95","v":0},{"$f":"U89+U93","v":0},{"$f":"IF(S95>2000000,IF(S95/S102<=11,\"OK\",\"PAS D'EFFICIENCE ECONOMIQUE\"),\"\")","v":""}]
[null,"4/ DIMENSIONNEMENT CHAUFFERIE BOIS",null,null,null,null,null,null,null,null,null,null,null,null,null,null,"coût Total  du projet éligible",null,{"$f":"S76+S80+S87+S93","v":0}]
[null,"Caractéristique de l'installation bois",null,null,null,null,null,null,"Dimensionnement silo (facultatif)",null,null,null,null,null,null,null,"surcout du projet",null,{"$f":"S95-R63","v":0},null,{"$f":"U95-R63","v":0}]
[null,"Puissance totale délivrée (kW)",{"$f":"SUM(D70:D94)","v":0},null,null,null,null,null,"puissance bois",{"$f":"C99","v":0},"kW",null,null,null,null,null,null,null,null,null,null,null,"13/SYNTHESE SCENARIO BOIS / CRITERES ELIGIBILITE DU PBEB"]
[null,"Puissance Bois (kW)",null,"temps fonctionnement pleine puissance (heures)",null,{"$f":"IF(C99=0,0,C106*C109/C99*1000)","v":0},null,null,"autonomie pleine puissance",null,"jours",null,null,null,null,null,"12/ CALCUL DES AIDES pour la SOLUTION BOIS",null,null,null,null,"Coef coup de pouce TERTIAIRE","économie de fonctionnement annuelle après subvention, année 1 (hors annuités)",null,null,null,{"$f":"T63+U63+V63-AB70-AB73-AB78","v":0},null,"²"]
[null,"Puissance Appoint en chaufferie (kW)",null,null,null,null,null,null,"masse volumique du bois",{"$f":"IF(C103=\"bois déchiqueté\",IF(N100<35%,0.25,0.33),IF(C103=\"granulé\",0.6,\"renseigner en C59\"))","v":"renseigner en C59"},"tonne/m3","Humidité du bois : ",null,null,null,null,"Critères de calcul de l'aide:","Grande entreprise","Activité non économique","Collectif ou tertaire","Tertiaire",{"$f":"IFERROR((COUNTIF('Scénario 2'!$F$9:$F$33,\"gaz naturel\")*3+COUNTIF('Scénario 2'!$F$9:$F$33,\"fioul\")*4+COUNTIF('Scénario 2'!$F$9:$F$33,\"PAC\")*5+COUNTIF('Scénario 2'!$F$9:$F$33,\"propane\")*3+COUNTIF('Scénario 2'!$F$9:$F$33,\"PAC\")+COUNTIF('Scénario 2'!$F$9:$F$33,\"granulé\")+COUNTIF('Scénario 2'!$F$9:$F$35,\"bois déchiqueté\")+COUNTIF('Scénario 2'!$F$9:$F$35,\"électricité\"))/(COUNTIF('Scénario 2'!$F$9:$F$33,\"gaz naturel\")+COUNTIF('Scénario 2'!$F$9:$F$33,\"fioul\")+COUNTIF('Scénario 2'!$F$9:$F$33,\"PAC\")+COUNTIF('Scénario 2'!$F$9:$F$33,\"propane\")+COUNTIF('Scénario 2'!$F$9:$F$33,\"PAC\")+COUNTIF('Scénario 2'!$F$9:$F$33,\"granulé\")+COUNTIF('Scénario 2'!$F$9:$F$33,\"bois déchiqueté\")+COUNTIF($F$9:$F$33,\"électricité\")),1)","v":1},"temps de retour avant subvention (ans)",null,null,null,{"$f":"IF(AA99=0,\"\",(S95-R63)/AA99)","v":""}]
[null,null,null,null,null,null,null,null,"PCI bois",{"$f":"(5080-58*N100*100)","v":5080},"KWh/tonne","volume par livraison :",null,null,null,null,"réseau de chaleur avec vente avec > 2 sous stations","<100%EnR","Projet sans gouvernance citoyenne","Projet chaufferie déchiqueté","Chauffage + ECS",null,"temps de retour, après subvention (ans)",null,null,null,{"$f":"IF(AA99=0,\"\",(U95-R63)/AA99)","v":""}]
[null,"besoins utiles livrés ou sortie chaud. (MWh)",null,null,null,{"$f":"ROUND(SUM(E70:E94)-IF(C114=\"Oui\",C118)-IF(F114=\"Oui\",F118),0)","v":0},null,null,"volume utile",{"$f":"J98*24*J99/J101/J100","v":{"$error":"#VALUE!"}},"m3","nombre de livraison :",null,{"$f":"IF(AND(ISNUMBER(J100)=TRUE,N101>0),ROUND(E106/J100/N101,0),0)","v":0},null,null,"MWh bois sorties chaudière :",null,{"$f":"F103/F110","v":0},null,{"$f":"CONCATENATE(\"soit \",ROUND(S102/11.63,0),\" tep\")","v":"soit 0 tep"},null,"temps de retour actualisé, après subvention (ans)",null,null,null,{"$f":"IF(CM27<=19,CM27,\">20 ans\")","v":">20 ans"}]
[null,"énergie bois prévue :",null,"taux de couverture bois :",null,{"$f":"E103*F102","v":0},null,null,"volume total",{"$f":"J102/N103","v":{"$error":"#VALUE!"}},"m3","taux de remplissage silo",null,null,null,null,"MWh bois éligibles (si plafonnement) :",null,{"$f":"IFERROR(IF(T101=\"Projet chaufferie granulé\",MIN(240,S102,SUMPRODUCT(_xlfn._xlws.FILTER(M9:M33,M9:M33>0),_xlfn._xlws.FILTER(E9:E33,E9:E33>0))/1000+I34*J34),MIN(S102,SUMPRODUCT(_xlfn._xlws.FILTER(M9:M33,M9:M33>0),_xlfn._xlws.FILTER(E9:E33,E9:E33>0))/1000+I34*J34)),0)","v":0},{"$f":"IFERROR(\"Eligible sur \"&IF(ROUND(S103/K34*100,0)>100,100,ROUND(S103/K34*100,0))&\"% des besoins globaux\",0)","v":0},null,null,"coût chaufferie bois par kW (€)",null,null,null,{"$f":"IF(C99=0,0,(S80+S76+S83)/C99)","v":0}]
[null,"énergie d'appoint prévue :",null,"taux de couverture appoint :",{"$f":"1-E103","v":1},{"$f":"E104*F102","v":0},{"$f":"IFERROR(IF(F104/C100>500,\"TROP D'APPOINT FOSSILE SI NEUF\",\"OK\"),\"\")","v":""},null,"Capacité utile",{"$f":"J102*J100","v":{"$error":"#VALUE!"}},"tonnes",null,null,null,null,null,null,null,"aide forfaitaire calculée sans plafond RGEC (plafond aide FC + CEE pris en compte)","aide retenue selon plafond RGEC",null,null,"coût réseau par ml (sous-station comprise) (€)",null,null,null,{"$f":"IF(OR(R84=0,R84=\"\"),\"\",(S84+S85+S86)/R84)","v":""}]
[null,null,null,null,null,null,null,null,"Capacité totale",{"$f":"J103*J100","v":{"$error":"#VALUE!"}},"tonnes",null,null,null,null,null,null,null,null,null,{"$f":"IF(S100=\"activité non économique\",\"% investissement\",\"% investissement (hors appoint)\")","v":"% investissement"},null,"chiffre d'affaire (hors marge)",null,null,null,{"$f":"V174","v":0}]
[null,"consommation bois entrée chaufferie",{"$f":"ROUND(F103/C109/F110,0)","v":0},"soit ",{"$f":"C106*1000/(5080-58*N100*100)","v":0},"tonnes",null,null,null,null,null,null,null,null,null,null,"1-Aide production de chaleur",null,{"$f":"SUM(S107:S110)","v":0},null,null,null,"tonnes de bois consommées",null,null,null,{"$f":"E106","v":0}]
[null,"consommation appoint entrée chaufferie",{"$f":"ROUND(F104/C110/F110,0)","v":0},null,null,null,null,null,null,null,null,null,null,null,null,null,"Aide ADEME - Fonds chaleur sans plafonnement CEE",{"$f":"IF(T100=\"Agricole, artisanal ou Industriel\",IF(S103<600,240*S103,IF(AND(S103>600,S103<3000),240*600+(S103-600)*120,IF(AND(S103>3000,S103<6000),240*600+120*2400+(S103-3000)*60,240*600+120*2400+60*3000+(S103-6000)*20))),IF(S103<600,420*S103,IF(AND(S103>600,S103<3000),420*600+(S103-600)*170,IF(AND(S103>3000,S103<6000),420*600+170*2400+(S103-3000)*80,420*600+170*2400+80*3000+(S103-6000)*50))))","v":0},null,null,null,null,"Origine du combustible",null,null,null,"granulés"]
[null,null,null,null,null,null,null,null,null,null,null,null,null,null,null,null,"Aide ADEME - Fonds chaleur après plafonnement CEE",null,{"$f":"IF(R107+R117>0.65*(S76+S80+S93),IF(0.65*(S76+S80+S93)-R117<0,0,0.65*(S76+S80+S93)-R117),R107)","v":0},null,null,null,"tep EnR consommées",null,null,null,{"$f":"C106/11.63","v":0}]
[null,"rendement production bois",0.82,"pertes réseaux et sous-stations",null,{"$f":"IF(G109=\"isolation standard\",ROUND(L166*220*24/1000,0), IF(G109=\"isolation +\",ROUND(N166*220*24/1000,0), ROUND(O166*220*24/1000,0)))","v":0},"Isolation standard",null,null,null,null,null,null,null,null,null,"autre aide (FEDER, DSIL ...)",null,0,null,null,null,"tep substituées",null,null,null,{"$f":"(G64-C107)/11.63","v":0}]
[null,"rendement production appoint",0.9,"rendement réseau et sous-stations",null,{"$f":"IF(F109=0,1,(F102)/(F102+F109))","v":1},null,null,null,null,null,null,null,null,null,null,"autre aide (FEDER, DSIL ...)",null,0,null,null,null,"investissement par tep substituée (€)",null,null,null,{"$f":"IF(AA109=0,0,S89/AA109)","v":0}]
[null,null,null,null,null,null,null,null,null,null,null,null,null,null,null,null,"2-Aide réseau de chaleur",null,{"$f":"SUM(S112:S114)","v":0},null,null,null,"tonnes de CO2 évitées/an",null,null,null,{"$f":"SUMIF(D39:G63,\"électricité\",G39:G63)*0.181+SUMIF(D39:G63,\"fioul\",G39:G63)*0.266+SUMIF(D39:G63,\"gaz naturel\",G39:G63)*0.187+SUMIF(D39:G63,\"propane\",G39:G63)*0.232","v":0}]
[null,"5/ COUPLAGE AVEC UNE AUTRE ENR",null,null,null,null,null,null,null,null,null,null,null,null,null,null,"Aide ADEME - Fonds chaleur",null,{"$f":"IF(AA114<1,0,MIN(S87,390*D183+450*D180+610*D177+770*D174+1190*D169))","v":0},null,null,null,"aide par tep substituée sortie chaudière",null,null,null,{"$f":"IF(AA109=0,0,S116/AA109)","v":0}]
[null,null,null,null,null,null,null,null,null,null,null,null,null,null,null,null,"autre aide (à préciser)",null,0,null,null,null,"emploi généré en équivalent temps plein",null,null,null,{"$f":"IF(AND(C99<1000,AA107=\"plaquettes bocagères\"),AA109*(11+1.8)/1000,IF(AND(C99<1000,AA107=\"plaquettes forestières\"),AA109*(1.8+6.4)/1000,IF(AND(C99<1000,AA107=\"plaquettes bois de fin de vie\"),AA109*(1.8+7.7)/1000,IF(AND(C99<1000,AA107=\"granulés\"),AA109*(1.8+1)/1000,IF(C99>1000,AA109*(1.1+6.4)/1000, )))))","v":0}]
[null,"Couplage avec du solaire thermique ?","Non",null,"Couplage avec du géothermie ?","Non",null,null,null,null,null,null,null,null,null,null,"autre aide (à préciser)",null,0,null,null,null,"chaleur livrée par ml de réseau (MWh)",null,null,null,{"$f":"IF(OR(R84=0,R84=\"\"),\"\",F102/R84)","v":""}]
[null,"Coût de l'investissement sans subvention (€)",null,null,"Coût de l'investissement subvention déduite (€)",null,null,null,null,null,null,null,null,null,null,null,"3-Bonus Citoyen Fond Chaleur",null,{"$f":"IF(S101=\"Projet à gouvernance citoyenne\",10%*(S108+S112),0)","v":0},null,null,null,"temps fonctionnement pleine puissance (heures)",null,null,null,{"$f":"IF(C99=0,0,C106*C109/C99*1000)","v":0}]
[null,"Montant de subvention (€)",null,null,"Coût de l'investissement subvention déduite (€)",null,null,null,null,null,null,null,null,null,null,null,"1 + 2 + 3 =Aides publiques totales",null,{"$f":"S111+S106+S115","v":0},{"$f":"IF(OR(Q101=\"chaufferie bois dédiée \",Q101=\"réseau technique\", Q101=\"réseau avec vente à 1 sous-station\"),IF(R100=\"grande entreprise\",MIN(S116,0.45*S96),IF(R100=\"moyenne entreprise\",MIN(S116,0.55*S96),IF(R100=\"petite entreprise\",MIN(S116,0.65*S96),IF(AND(R100=\"collectivité\",S100=\"activité économique\"),MIN(S116,0.65*S96),MIN(S116,0.8*S96))))),IF(Q101=\"réseau de chaleur avec vente avec > 2 sous stations\",MAX(T120,(IF(R101=\"<100%EnR\",IF(R100=\"grande entreprise\",MIN(S116,0.3*S96),IF(R100=\"moyenne entreprise\",MIN(S116,0.4*S96),MIN(S116,0.5*S96))),IF(R100=\"grande entreprise\",MIN(S116,(0.3+0.15)*S96),IF(R100=\"moyenne entreprise\",MIN(S116,(0.4+0.15)*S96),MIN(S116,(0.5+0.15)*S96))))))))","v":0},{"$f":"IF(S96=0,0,T116/(S96))","v":0},null,"CO2 en équivalents tours de la Terre en voiture",null,null,null,{"$f":"AA111*1000/0.16/40075","v":0}]
[null,"Coût de l'investissement subvention déduite (€)",{"$f":"IF(AND(C114=\"Oui\",$Q$101=\"réseau de chaleur avec vente avec > 2 sous stations\"),MIN($S$96/(T116+C116),0.65*$S$96),(C115-C116))","v":0},null,"Coût de l'investissement subvention déduite (€)",{"$f":"IF(AND(F114=\"Oui\",$Q$101=\"réseau de chaleur avec vente avec > 2 sous stations\"),MIN($S$96/(W115+F116),0.65*$S$96),(F115-F116))","v":0},null,null,null,null,null,null,null,null,null,null,"CEE changement chaudière :",{"$f":"IF(Q101=\"réseau de chaleur avec vente avec > 2 sous stations\",0,\nIF(U100=\"Tertiaire\",IF(C99<=500,4.8*F103,3.4*F103),IF(C99<=500,4.8*F103,3.4*F103)))*Y88","v":0},null,{"$f":"R117","v":0},null,null,"économie de fonctionnement supplémentaires injectée dans le territoire",null,null,null,{"$f":"AB71+0.2*AB72+0.9*AB76-0.2*T63-0.9*U63","v":0}]
[null,"Production EnR (MWh)",null,null,"Production EnR (MWh)",null,null,null,null,null,null,null,null,null,null,null,"CEE  raccordement RC /Nb de logements raccordés si résidentiel :",{"$f":"IF(OR(R117<>0,Q101<>\"réseau de chaleur avec vente avec > 2 sous stations\"),0,_xlfn.IFS(U100=\"Résidentiel individuel\",40.2*_xlfn.IFS(SUM($E$9:$E$33)<70,0.5,SUM($E$9:$E$33)<90,0.7,SUM($E$9:$E$33)<110,1,SUM($E$9:$E$33)<=130,1.1,SUM($E$9:$E$33)>130,1.6)*$Y$88,U100=\"Résidentiel collectif\",(SUMIF(C9:C33,\"<=125\")*24+COUNTIF(C9:C33,\"<=125\")*9000+(SUMIF(C9:C33,\">125\")*54+COUNTIF(C9:C33,\">125\")*5200))*$Y$88,U100=\"Tertiaire\",IF(U101=\"Chauffage seul \",SUMPRODUCT($D$196:$D$207,$E$196:$E$207)*0.9*$Y$88/1000+SUMPRODUCT($J$196:$J$207,$K$196:$K$207)*0.9*$Y$88/1000,SUMPRODUCT($D$196:$D$207,$F$196:$F$207)*0.9*$Y$88/1000)+SUMPRODUCT($J$196:$J$207,$L$196:$L$207)*0.9*$Y$88/1000))\n\n+ IF(AND(Q101=\"réseau de chaleur avec vente avec > 2 sous stations\",F102<>0),(SUMPRODUCT(P9:P33,E9:E33)*0.2+9500*SUM(P9:P33))*$Y$88+(SUMIF(E9:E33,\">7500\")*0.8+5000*COUNTIF(E9:E33,\">7500\"))*$Y$88\n+(SUMPRODUCT(Q9:Q33,C9:C33)*24+9000*SUM(Q9:Q33))*$Y$88+(SUMIF(C9:C33,\">125\")*54+5200*COUNTIF(E9:E33,\">125\"))*$Y$88,0)","v":0},null,{"$f":"R118","v":0}]
[null,"P2 (€)",null,null,"P1 (€)",null,null,null,null,null,null,null,null,null,null,null,"1  + 2 + 3 + CEE = Aides totales",null,{"$f":"S116+R117+R118","v":0},{"$f":"T116+T117+T118","v":0},{"$f":"IF(S96=0,0,IF(T119/(S96)>1,1,T119/(S96)))","v":0}]
[null,"P3 (€)",null,null,"P2 (€)",null,null,null,null,null,null,null,null,null,null,null,"Valeur à reporter à partir de la cellule A48 renseignée dans l'onglet \"déficit de financement\" :"]
[null,null,null,null,"P3 (€)"]
[]
[null,"6/ DIMENSIONNEMENT DIAMETRES RESEAU DE CHALEUR",null,null,null,null,null,null,null,null,null,null,null,null,null,null,"14/ COUT DU MWh"]
[null,null,null,null,null,null,null,null,"Réseau préisolé enterré 90/70 °C"]
[null,"tronçon","Longueur de tranchée (m)","Longueur canalisation A/R (m)","Puissance à livrer (KW)","DT °C","Débit m3/h","DN \n","Pertes W/ml\nisolation standard\nA+R","Pertes W/ml\nisolation +\nA+R","Pertes W/ml\nisolation ++\nA+R","Pertes kW\nisolation standard\nA+R",null,"Pertes kW\nisolation +\nA+R","Pertes kW\nisolation ++\nA+R",null,"Coût du MWh utile en année 1"]
[null,null,null,{"$f":"(C126*2)","v":0},null,20,{"$f":"(E126/(1.163*F126))","v":0},{"$f":"IF($G126=0,\"\",VLOOKUP($G126,$H$170:$N$177,3,TRUE))","v":""},{"$f":"IF($G126=0,\"\",VLOOKUP($G126,$H$170:$N$177,4,TRUE))","v":""},{"$f":"IF($G126=0,\"\",VLOOKUP($G126,$H$170:$N$177,5,TRUE))","v":""},{"$f":"IF($G126=0,\"\",VLOOKUP($G126,$H$170:$N$177,7,TRUE))","v":""},{"$f":"IF($C126=\"\",\"\",I126*$C126/1000)","v":""},null,{"$f":"IF($C126=\"\",\"\",J126*$C126/1000)","v":""},{"$f":"IF($C126=\"\",\"\",K126*$C126/1000)","v":""}]
[null,null,null,{"$f":"(C127*2)","v":0},null,20,{"$f":"(E127/(1.163*F127))","v":0},"","","",{"$f":"IF($G127=0,\"\",VLOOKUP($G127,$H$170:$N$177,7,TRUE))","v":""},"",null,"","",null,null,"coût du MWh utile",null,"dépenses totales"]
[null,null,null,0,null,20,0,"","","","","",null,"","",null,null,"bois","référence","bois","référence"]
[null,null,null,0,null,20,0,"","","","","",null,"","",null,"P1 - énergie bois",{"$f":"IF($F$102=0,0,T129/$F$102)","v":0},{"$f":"IF($J$64=0,0,U129/$J$64)","v":0},{"$f":"AB71","v":0}]
[null,null,null,0,null,20,0,"","","","","",null,"","",null,{"$f":"\"P1 - énergie appoint/ref\" &IF(F114=\"Oui\",\"dont P1 géothermie\",\"\")","v":"P1 - énergie appoint/ref"},{"$f":"IF($F$102=0,0,T130/$F$102)","v":0},{"$f":"IF($J$64=0,0,U130/$J$64)","v":0},{"$f":"AB72","v":0},{"$f":"T63","v":0}]
[null,null,null,0,null,20,0,"","","","","",null,"","",null,{"$f":"\"P2 - maintenance\"&IF(C114=\"Oui\",\"+ P2 ST\",\"\")&IF(F114=\"Oui\",\"+ P2 GEO\",\"\")","v":"P2 - maintenance"},{"$f":"IF($F$102=0,0,T131/$F$102)","v":0},{"$f":"IF($J$64=0,0,U131/$J$64)","v":0},{"$f":"AB73","v":0},{"$f":"U63","v":0}]
[null,null,null,0,null,20,0,"","","","","",null,"","",null,{"$f":"\"P3 - gros entretien\"&IF(C114=\"Oui\",\"+ P3 ST\",\"\")&IF(F114=\"Oui\",\"+ P3 GEO\",\"\")","v":"P3 - gros entretien"},{"$f":"IF($F$102=0,0,T132/$F$102)","v":0},{"$f":"IF($J$64=0,0,U132/$J$64)","v":0},{"$f":"AB78","v":0},{"$f":"V63","v":0}]
[null,null,null,0,null,20,0,"","","","","",null,"","",null,{"$f":"\"P4 - amortissements\"&IF(C114=\"Oui\",\"+ P4 ST\",\"\")&IF(F114=\"Oui\",\"+ P4 GEO\",\"\")","v":"P4 - amortissements"},{"$f":"IF($F$102=0,0,T133/$F$102)","v":0},{"$f":"IF($J$64=0,0,U133/$J$64)","v":0},{"$f":"AB81","v":{"$error":"#NUM!"}},{"$f":"W63","v":0}]
[null,null,null,0,null,20,0,"","","","","",null,"","",null,"TOTAL",{"$f":"SUM(R129:R133)","v":0},{"$f":"SUM(S129:S133)","v":0},{"$f":"SUM(T129:T133)","v":{"$error":"#NUM!"}},{"$f":"SUM(U129:U133)","v":0}]
[null,null,null,0,null,20,0,"","","","","",null,"","",null,{"$f":"IF(W7=\"oui\",IF(W8=\"oui\",\"\",\"TVA (si vente chaleur)\"),\"\")","v":""},{"$f":"IF(W7=\"oui\",IF(W8=\"oui\",\"\",0.055*R214),\"\")","v":""},{"$f":"IF(W7=\"oui\",IF(W8=\"oui\",\"\",0.2*S214),\"\")","v":""}]
[null,null,null,0,null,20,0,"","","","","",null,"","",null,{"$f":"IF(W7=\"oui\",IF(W8=\"oui\",\"\",\"TOTAL TTC\"),\"\")","v":""},{"$f":"IF(W7=\"oui\",IF(W8=\"oui\",\"\",R214+R215),\"\")","v":""},{"$f":"IF(W7=\"oui\",IF(W8=\"oui\",\"\",S214+S215),\"\")","v":""}]
[null,null,null,0,null,20,0,"","","","","",null,"",""]
[null,null,null,0,null,20,0,"","","","","",null,"","",null,"1ère approche de Tarification de la chaleur (si vente)"]
[null,null,null,0,null,20,0,"","","","","",null,"",""]
[null,null,null,0,null,20,0,"","","","","",null,"","",null,"MWh livrés",null,null,{"$f":"F102","v":0}]
[null,null,null,0,null,20,0,"","","","","",null,"","",null,"Puissance totale raccordées",null,null,{"$f":"C98","v":0}]
[null,null,null,0,null,20,0,"","","","","",null,"","",null,"coût unitaire R1 par MWh utile",null,null,{"$f":"IF(OR(T140=0,AB70=0),0,AB70/T140)","v":0}]
[null,null,null,0,null,20,0,"","","","","",null,"","",null,"coût unitaire R2 par kW",null,null,{"$f":"IF(OR(T141=0,T140=0),0,(AB73+AB78+AB81)/T141)","v":0}]
[null,null,null,0,null,20,0,"","","","","",null,"",""]
[null,null,null,0,null,20,0,"","","","","",null,"",""]
[null,null,null,0,null,20,0,"","","","","",null,"","",null,"PREMIERE APPROCHE DU COUT DU MWH PAR ABONNES (si vente de chaleur)"]
[null,null,null,0,null,20,0,"","","","","",null,"","",null,null,"scénario bois",null,null,null,null,null,null,"scénario référence",null,null,null,null,null,null,null,null,"delta TTC"]
[null,null,null,0,null,20,0,"","","","","",null,"","",null,null,"R1 bois","R2 bois","R1+R2","TVA (si vente de chaleur)","R1 + R2 TTC","€/MWh HT","€/MWh TTC","P1 référence","P2 référence","P3 référence","P4 référence","cout annuel HT","TVA","cout annuel TTC","€/Mwh HT","€/Mwh TTC"]
[null,null,null,0,null,20,0,"","","","","",null,"","",null,{"$f":"IF(D9=0,\"\",D9)","v":" "},{"$f":"$T$142*E70","v":0},{"$f":"$T$143*D70","v":0},{"$f":"R149+S149","v":0},{"$f":"IF($W$7=\"oui\",T149*(5.5%),T149*(20%))","v":0},{"$f":"T149+U149","v":0},{"$f":"IF(E70=0,0,T149/(E70))","v":0},{"$f":"IF(E70=0,0,V149/(E70))","v":0},{"$f":"IF(OR(F39=\"\",G39=\"\"),0,G39*(1+_xlfn.IFS(OR(D39=\"PAC\",D39=\"électricité\"),$Y$91,OR(D39=\"granulé\",D39=\"bois déchiqueté\"),$Y$90,OR(D39=\"fioul\",D39=\"gaz naturel\",D39=\"propane\"),$Y$92))*VLOOKUP(D39,$Y$7:$Z$12,2))","v":0},{"$f":"IF(F39=\"\",0,IF(AND(F39>1,F39<8.99),250,IF(AND(F39>9,F39<96),0.18*F39^2-7.6*F39+300,IF(AND(F39>95,F39<951),6.6*F39+530,IF(AND(F39>950,F39<3501),F39+5800,IF(F39>3500,3.2*F39-1900,\"\"))))))*1.3","v":0},{"$f":"0.01*IF(F39=0,0,IF($C39=\"\",\"définir le type de travaux envisagé pour ce batiment\",IF($F39=0,0,O9*IF(AND($F39>9,$F39<151),0.57*$F39^2+76*$F39+2500,IF(AND($F39>150,$F39<951),56.1*$F39+18300,IF(AND($F39>950,$F39<14501),34.3*$F39+39000,IF($F39>14500,20.3*$F39+242000,\"\")))))))*1.3","v":0},{"$f":"IF(X38=\"\",-PMT($AA$83,$Z$83,IF(F39=0,0,IF($C39=\"\",\"définir le type de travaux envisagé pour ce batiment\",IF($F39=0,0,O9*IF(AND($F39>9,$F39<151),0.57*$F39^2+76*$F39+2500,IF(AND($F39>150,$F39<951),56.1*$F39+18300,IF(AND($F39>950,$F39<14501),34.3*$F39+39000,IF($F39>14500,20.3*$F39+242000,\"\")))))))*1.3),-PMT($AA$83,X38,IF(F39=0,0,IF($C39=\"\",\"définir le type de travaux envisagé pour ce batiment\",IF($F39=0,0,O9*IF(AND($F39>9,$F39<151),0.57*$F39^2+76*$F39+2500,IF(AND($F39>150,$F39<951),56.1*$F39+18300,IF(AND($F39>950,$F39<14501),34.3*$F39+39000,IF($F39>14500,20.3*$F39+242000,\"\")))))))*1.3))","v":{"$error":"#NUM!"}},{"$f":"SUM(Y149:AB149)","v":{"$error":"#NUM!"}},{"$f":"AC149*W9","v":{"$error":"#NUM!"}},{"$f":"AD149+AC149","v":{"$error":"#NUM!"}},{"$f":"IF(J39=0,0,AC149/(J39))","v":{"$error":"#NUM!"}},{"$f":"IF(J39=0,0,AE149/(J39))","v":{"$error":"#NUM!"}},{"$f":"IF(AE149=0,0,(V149-AE149)/AE149)","v":{"$error":"#NUM!"}}]
[null,null,null,0,null,20,0,"","","","","",null,"","",null," ",{"$f":"$T$142*E71","v":0},{"$f":"$T$143*D71","v":0},{"$f":"R150+S150","v":0},{"$f":"IF($W$7=\"oui\",T150*(5.5%),T150*(20%))","v":0},{"$f":"T150+U150","v":0},{"$f":"IF(E71=0,0,T150/(E71))","v":0},{"$f":"IF(E71=0,0,V150/(E71))","v":0},{"$f":"IF(OR(F40=\"\",G40=\"\"),0,G40*(1+_xlfn.IFS(OR(D40=\"PAC\",D40=\"électricité\"),$Y$91,OR(D40=\"granulé\",D40=\"bois déchiqueté\"),$Y$90,OR(D40=\"fioul\",D40=\"gaz naturel\",D40=\"propane\"),$Y$92))*VLOOKUP(D40,$Y$7:$Z$12,2))","v":0},{"$f":"IF(F40=\"\",0,IF(AND(F40>1,F40<8.99),250,IF(AND(F40>9,F40<96),0.18*F40^2-7.6*F40+300,IF(AND(F40>95,F40<951),6.6*F40+530,IF(AND(F40>950,F40<3501),F40+5800,IF(F40>3500,3.2*F40-1900,\"\"))))))*1.3","v":0},0,{"$error":"#NUM!"},{"$f":"SUM(Y150:AB150)","v":{"$error":"#NUM!"}},{"$error":"#NUM!"},{"$f":"AD150+AC150","v":{"$error":"#NUM!"}},{"$error":"#NUM!"},{"$error":"#NUM!"},{"$f":"IF(AE150=0,0,(V150-AE150)/AE150)","v":{"$error":"#NUM!"}}]
[null,null,null,0,null,20,{"$f":"(E151/(1.163*F151))","v":0},"","","","","",null,"","",null," ",0,0,0,0,0,0,0,{"$f":"IF(OR(F41=\"\",G41=\"\"),0,G41*(1+_xlfn.IFS(OR(D41=\"PAC\",D41=\"électricité\"),$Y$91,OR(D41=\"granulé\",D41=\"bois déchiqueté\"),$Y$90,OR(D41=\"fioul\",D41=\"gaz naturel\",D41=\"propane\"),$Y$92))*VLOOKUP(D41,$Y$7:$Z$12,2))","v":0},0,0,{"$error":"#NUM!"},{"$error":"#NUM!"},{"$error":"#NUM!"},{"$error":"#NUM!"},{"$error":"#NUM!"},{"$error":"#NUM!"},{"$error":"#NUM!"}]
[null,null,null,0,null,20,0,"","","","","",null,"","",null," ",0,0,0,0,0,0,0,{"$f":"IF(OR(F42=\"\",G42=\"\"),0,G42*(1+_xlfn.IFS(OR(D42=\"PAC\",D42=\"électricité\"),$Y$91,OR(D42=\"granulé\",D42=\"bois déchiqueté\"),$Y$90,OR(D42=\"fioul\",D42=\"gaz naturel\",D42=\"propane\"),$Y$92))*VLOOKUP(D42,$Y$7:$Z$12,2))","v":0},0,0,{"$error":"#NUM!"},{"$error":"#NUM!"},{"$error":"#NUM!"},{"$error":"#NUM!"},{"$error":"#NUM!"},{"$error":"#NUM!"},{"$error":"#NUM!"}]
[null,null,null,0,null,20,0,"","","","","",null,"","",null," ",0,0,0,0,0,0,0,{"$f":"IF(OR(F43=\"\",G43=\"\"),0,G43*(1+_xlfn.IFS(OR(D43=\"PAC\",D43=\"électricité\"),$Y$91,OR(D43=\"granulé\",D43=\"bois déchiqueté\"),$Y$90,OR(D43=\"fioul\",D43=\"gaz naturel\",D43=\"propane\"),$Y$92))*VLOOKUP(D43,$Y$7:$Z$12,2))","v":0},0,0,{"$error":"#NUM!"},{"$error":"#NUM!"},{"$error":"#NUM!"},{"$error":"#NUM!"},{"$error":"#NUM!"},{"$error":"#NUM!"},{"$error":"#NUM!"}]
[null,null,null,0,null,20,0,"","","","","",null,"","",null," ",0,0,0,0,0,0,0,{"$f":"IF(OR(F44=\"\",G44=\"\"),0,G44*(1+_xlfn.IFS(OR(D44=\"PAC\",D44=\"électricité\"),$Y$91,OR(D44=\"granulé\",D44=\"bois déchiqueté\"),$Y$90,OR(D44=\"fioul\",D44=\"gaz naturel\",D44=\"propane\"),$Y$92))*VLOOKUP(D44,$Y$7:$Z$12,2))","v":0},0,0,{"$error":"#NUM!"},{"$error":"#NUM!"},{"$error":"#NUM!"},{"$error":"#NUM!"},{"$error":"#NUM!"},{"$error":"#NUM!"},{"$error":"#NUM!"}]
[null,null,null,0,null,20,0,"","","","","",null,"","",null," ",0,0,0,0,0,0,0,{"$f":"IF(OR(F45=\"\",G45=\"\"),0,G45*(1+_xlfn.IFS(OR(D45=\"PAC\",D45=\"électricité\"),$Y$91,OR(D45=\"granulé\",D45=\"bois déchiqueté\"),$Y$90,OR(D45=\"fioul\",D45=\"gaz naturel\",D45=\"propane\"),$Y$92))*VLOOKUP(D45,$Y$7:$Z$12,2))","v":0},0,0,{"$error":"#NUM!"},{"$error":"#NUM!"},{"$error":"#NUM!"},{"$error":"#NUM!"},{"$error":"#NUM!"},{"$error":"#NUM!"},{"$error":"#NUM!"}]
[null,null,null,0,null,20,0,"","","","","",null,"","",null," ",0,0,0,0,0,0,0,{"$f":"IF(OR(F46=\"\",G46=\"\"),0,G46*(1+_xlfn.IFS(OR(D46=\"PAC\",D46=\"électricité\"),$Y$91,OR(D46=\"granulé\",D46=\"bois déchiqueté\"),$Y$90,OR(D46=\"fioul\",D46=\"gaz naturel\",D46=\"propane\"),$Y$92))*VLOOKUP(D46,$Y$7:$Z$12,2))","v":0},{"$f":"IF(F46=\"\",0,IF(AND(F46>1,F46<8.99),250,IF(AND(F46>9,F46<96),0.18*F46^2-7.6*F46+300,IF(AND(F46>95,F46<951),6.6*F46+530,IF(AND(F46>950,F46<3501),F46+5800,IF(F46>3500,3.2*F46-1900,\"\"))))))*1.3","v":0},0,{"$error":"#NUM!"},{"$error":"#NUM!"},{"$error":"#NUM!"},{"$error":"#NUM!"},{"$error":"#NUM!"},{"$error":"#NUM!"},{"$error":"#NUM!"}]
[null,null,null,0,null,20,0,"","","","","",null,"","",null," ",0,0,0,0,0,0,0,{"$f":"IF(OR(F47=\"\",G47=\"\"),0,G47*(1+_xlfn.IFS(OR(D47=\"PAC\",D47=\"électricité\"),$Y$91,OR(D47=\"granulé\",D47=\"bois déchiqueté\"),$Y$90,OR(D47=\"fioul\",D47=\"gaz naturel\",D47=\"propane\"),$Y$92))*VLOOKUP(D47,$Y$7:$Z$12,2))","v":0},0,0,{"$error":"#NUM!"},{"$error":"#NUM!"},{"$error":"#NUM!"},{"$error":"#NUM!"},{"$error":"#NUM!"},{"$error":"#NUM!"},{"$error":"#NUM!"}]
[null,null,null,0,null,20,0,"","","","","",null,"","",null," ",0,0,0,0,0,0,0,{"$f":"IF(OR(F48=\"\",G48=\"\"),0,G48*(1+_xlfn.IFS(OR(D48=\"PAC\",D48=\"électricité\"),$Y$91,OR(D48=\"granulé\",D48=\"bois déchiqueté\"),$Y$90,OR(D48=\"fioul\",D48=\"gaz naturel\",D48=\"propane\"),$Y$92))*VLOOKUP(D48,$Y$7:$Z$12,2))","v":0},0,0,{"$error":"#NUM!"},{"$error":"#NUM!"},{"$error":"#NUM!"},{"$error":"#NUM!"},{"$error":"#NUM!"},{"$error":"#NUM!"},{"$error":"#NUM!"}]
[null,null,null,0,null,20,0,"","","","","",null,"","",null," ",0,0,0,0,0,0,0,{"$f":"IF(OR(F49=\"\",G49=\"\"),0,G49*(1+_xlfn.IFS(OR(D49=\"PAC\",D49=\"électricité\"),$Y$91,OR(D49=\"granulé\",D49=\"bois déchiqueté\"),$Y$90,OR(D49=\"fioul\",D49=\"gaz naturel\",D49=\"propane\"),$Y$92))*VLOOKUP(D49,$Y$7:$Z$12,2))","v":0},0,0,{"$error":"#NUM!"},{"$error":"#NUM!"},{"$error":"#NUM!"},{"$error":"#NUM!"},{"$error":"#NUM!"},{"$error":"#NUM!"},{"$error":"#NUM!"}]
[null,null,null,0,null,20,0,"","","","","",null,"","",null," ",0,0,0,0,0,0,0,{"$f":"IF(OR(F50=\"\",G50=\"\"),0,G50*(1+_xlfn.IFS(OR(D50=\"PAC\",D50=\"électricité\"),$Y$91,OR(D50=\"granulé\",D50=\"bois déchiqueté\"),$Y$90,OR(D50=\"fioul\",D50=\"gaz naturel\",D50=\"propane\"),$Y$92))*VLOOKUP(D50,$Y$7:$Z$12,2))","v":0},0,0,{"$error":"#NUM!"},{"$error":"#NUM!"},{"$error":"#NUM!"},{"$error":"#NUM!"},{"$error":"#NUM!"},{"$error":"#NUM!"},{"$error":"#NUM!"}]
[null,null,null,0,null,20,0,"","","","","",null,"","",null," ",0,0,0,0,0,0,0,{"$f":"IF(OR(F51=\"\",G51=\"\"),0,G51*(1+_xlfn.IFS(OR(D51=\"PAC\",D51=\"électricité\"),$Y$91,OR(D51=\"granulé\",D51=\"bois déchiqueté\"),$Y$90,OR(D51=\"fioul\",D51=\"gaz naturel\",D51=\"propane\"),$Y$92))*VLOOKUP(D51,$Y$7:$Z$12,2))","v":0},0,0,{"$error":"#NUM!"},{"$error":"#NUM!"},{"$error":"#NUM!"},{"$error":"#NUM!"},{"$error":"#NUM!"},{"$error":"#NUM!"},{"$error":"#NUM!"}]
[null,null,null,0,null,20,0,"","","","","",null,"","",null," ",0,0,0,0,0,0,0,{"$f":"IF(OR(F52=\"\",G52=\"\"),0,G52*(1+_xlfn.IFS(OR(D52=\"PAC\",D52=\"électricité\"),$Y$91,OR(D52=\"granulé\",D52=\"bois déchiqueté\"),$Y$90,OR(D52=\"fioul\",D52=\"gaz naturel\",D52=\"propane\"),$Y$92))*VLOOKUP(D52,$Y$7:$Z$12,2))","v":0},0,0,{"$error":"#NUM!"},{"$error":"#NUM!"},{"$error":"#NUM!"},{"$error":"#NUM!"},{"$error":"#NUM!"},{"$error":"#NUM!"},{"$error":"#NUM!"}]
[null,null,null,0,null,20,0,"","","","","",null,"","",null," ",0,0,0,0,0,0,0,{"$f":"IF(OR(F53=\"\",G53=\"\"),0,G53*(1+_xlfn.IFS(OR(D53=\"PAC\",D53=\"électricité\"),$Y$91,OR(D53=\"granulé\",D53=\"bois déchiqueté\"),$Y$90,OR(D53=\"fioul\",D53=\"gaz naturel\",D53=\"propane\"),$Y$92))*VLOOKUP(D53,$Y$7:$Z$12,2))","v":0},0,0,{"$error":"#NUM!"},{"$error":"#NUM!"},{"$error":"#NUM!"},{"$error":"#NUM!"},{"$error":"#NUM!"},{"$error":"#NUM!"},{"$error":"#NUM!"}]
[null,null,null,0,null,20,0,"","","","","",null,"","",null," ",0,0,0,0,0,0,0,{"$f":"IF(OR(F54=\"\",G54=\"\"),0,G54*(1+_xlfn.IFS(OR(D54=\"PAC\",D54=\"électricité\"),$Y$91,OR(D54=\"granulé\",D54=\"bois déchiqueté\"),$Y$90,OR(D54=\"fioul\",D54=\"gaz naturel\",D54=\"propane\"),$Y$92))*VLOOKUP(D54,$Y$7:$Z$12,2))","v":0},0,0,{"$error":"#NUM!"},{"$error":"#NUM!"},{"$error":"#NUM!"},{"$error":"#NUM!"},{"$error":"#NUM!"},{"$error":"#NUM!"},{"$error":"#NUM!"}]
[null,null,null,0,null,20,0,"","","","","",null,"","",null," ",0,0,0,0,0,0,0,{"$f":"IF(OR(F55=\"\",G55=\"\"),0,G55*(1+_xlfn.IFS(OR(D55=\"PAC\",D55=\"électricité\"),$Y$91,OR(D55=\"granulé\",D55=\"bois déchiqueté\"),$Y$90,OR(D55=\"fioul\",D55=\"gaz naturel\",D55=\"propane\"),$Y$92))*VLOOKUP(D55,$Y$7:$Z$12,2))","v":0},0,0,{"$error":"#NUM!"},{"$error":"#NUM!"},{"$error":"#NUM!"},{"$error":"#NUM!"},{"$error":"#NUM!"},{"$error":"#NUM!"},{"$error":"#NUM!"}]
[null,"Total",{"$f":"SUM(C126:C165)","v":0},"densité thermique du réseau :",null,{"$f":"IF(C166=0,\"\",$F$102/C166)","v":""},null,null,null,null,null,{"$f":"SUM(L126:L165)","v":0},null,{"$f":"SUM(N126:N165)","v":0},{"$f":"SUM(O126:O165)","v":0},null," ",0,0,0,0,0,0,0,{"$f":"IF(OR(F56=\"\",G56=\"\"),0,G56*(1+_xlfn.IFS(OR(D56=\"PAC\",D56=\"électricité\"),$Y$91,OR(D56=\"granulé\",D56=\"bois déchiqueté\"),$Y$90,OR(D56=\"fioul\",D56=\"gaz naturel\",D56=\"propane\"),$Y$92))*VLOOKUP(D56,$Y$7:$Z$12,2))","v":0},0,0,{"$error":"#NUM!"},{"$error":"#NUM!"},{"$error":"#NUM!"},{"$error":"#NUM!"},{"$error":"#NUM!"},{"$error":"#NUM!"},{"$error":"#NUM!"}]
[null,null,null,null,null,null,null,null,null,null,null,null,null,null,null,null," ",0,0,0,0,0,0,0,{"$f":"IF(OR(F57=\"\",G57=\"\"),0,G57*(1+_xlfn.IFS(OR(D57=\"PAC\",D57=\"électricité\"),$Y$91,OR(D57=\"granulé\",D57=\"bois déchiqueté\"),$Y$90,OR(D57=\"fioul\",D57=\"gaz naturel\",D57=\"propane\"),$Y$92))*VLOOKUP(D57,$Y$7:$Z$12,2))","v":0},0,0,{"$error":"#NUM!"},{"$error":"#NUM!"},{"$error":"#NUM!"},{"$error":"#NUM!"},{"$error":"#NUM!"},{"$error":"#NUM!"},{"$error":"#NUM!"}]
[null,"DN","Longueur de tranchée (ml)","Total métrés par tranche","ratio investissement","investissement",null,"Source INPAL",null,null,null,null,null,null,null,null," ",0,0,0,0,0,0,0,{"$f":"IF(OR(F58=\"\",G58=\"\"),0,G58*(1+_xlfn.IFS(OR(D58=\"PAC\",D58=\"électricité\"),$Y$91,OR(D58=\"granulé\",D58=\"bois déchiqueté\"),$Y$90,OR(D58=\"fioul\",D58=\"gaz naturel\",D58=\"propane\"),$Y$92))*VLOOKUP(D58,$Y$7:$Z$12,2))","v":0},0,0,{"$error":"#NUM!"},{"$error":"#NUM!"},{"$error":"#NUM!"},{"$error":"#NUM!"},{"$error":"#NUM!"},{"$error":"#NUM!"},{"$error":"#NUM!"}]
[null,"DN650",{"$f":"SUMPRODUCT(($H$126:$H$165=$B169)*($C$126:$C$165))","v":0},{"$f":"SUM(C169:C173)","v":0},1800,{"$f":"E169*C169","v":0},null,"débit mini (m3/h)","débit maxi m3/h","DN","Pertes W/ml\nIso standart\n(source INPAL)","Pertes W/ml - iso +\n(source INPAL)",null,"Pertes W/ml- iso ++\n(source INPAL)",null,null," ",0,0,0,0,0,0,0,{"$f":"IF(OR(F59=\"\",G59=\"\"),0,G59*(1+_xlfn.IFS(OR(D59=\"PAC\",D59=\"électricité\"),$Y$91,OR(D59=\"granulé\",D59=\"bois déchiqueté\"),$Y$90,OR(D59=\"fioul\",D59=\"gaz naturel\",D59=\"propane\"),$Y$92))*VLOOKUP(D59,$Y$7:$Z$12,2))","v":0},0,0,{"$error":"#NUM!"},{"$error":"#NUM!"},{"$error":"#NUM!"},{"$error":"#NUM!"},{"$error":"#NUM!"},{"$error":"#NUM!"},{"$error":"#NUM!"}]
[null,"DN600",0,null,1700,0,null,0.1,5,"DN40",33,33,null,33,null,null," ",0,0,0,0,0,0,0,{"$f":"IF(OR(F60=\"\",G60=\"\"),0,G60*(1+_xlfn.IFS(OR(D60=\"PAC\",D60=\"électricité\"),$Y$91,OR(D60=\"granulé\",D60=\"bois déchiqueté\"),$Y$90,OR(D60=\"fioul\",D60=\"gaz naturel\",D60=\"propane\"),$Y$92))*VLOOKUP(D60,$Y$7:$Z$12,2))","v":0},0,0,{"$error":"#NUM!"},{"$error":"#NUM!"},{"$error":"#NUM!"},{"$error":"#NUM!"},{"$error":"#NUM!"},{"$error":"#NUM!"},{"$error":"#NUM!"}]
[null,"DN550",0,null,1600,0,null,6,10,"DN65",34.17,28.65,null,25.1,null,null," ",0,0,0,0,0,0,0,{"$f":"IF(OR(F61=\"\",G61=\"\"),0,G61*(1+_xlfn.IFS(OR(D61=\"PAC\",D61=\"électricité\"),$Y$91,OR(D61=\"granulé\",D61=\"bois déchiqueté\"),$Y$90,OR(D61=\"fioul\",D61=\"gaz naturel\",D61=\"propane\"),$Y$92))*VLOOKUP(D61,$Y$7:$Z$12,2))","v":0},0,0,{"$error":"#NUM!"},{"$error":"#NUM!"},{"$error":"#NUM!"},{"$error":"#NUM!"},{"$error":"#NUM!"},{"$error":"#NUM!"},{"$error":"#NUM!"}]
[null,"DN500",0,null,1500,0,null,11,15,"DN80",35.22,30,null,26.57,null,null," ",0,0,0,0,0,0,0,{"$f":"IF(OR(F62=\"\",G62=\"\"),0,G62*(1+_xlfn.IFS(OR(D62=\"PAC\",D62=\"électricité\"),$Y$91,OR(D62=\"granulé\",D62=\"bois déchiqueté\"),$Y$90,OR(D62=\"fioul\",D62=\"gaz naturel\",D62=\"propane\"),$Y$92))*VLOOKUP(D62,$Y$7:$Z$12,2))","v":0},0,0,{"$error":"#NUM!"},{"$error":"#NUM!"},{"$error":"#NUM!"},{"$error":"#NUM!"},{"$error":"#NUM!"},{"$error":"#NUM!"},{"$error":"#NUM!"}]
[null,"DN450",0,null,1400,0,null,16,20,"DN100",36.86,31.31,null,27.56,null,null," ",0,0,0,0,0,0,0,{"$f":"IF(OR(F63=\"\",G63=\"\"),0,G63*(1+_xlfn.IFS(OR(D63=\"PAC\",D63=\"électricité\"),$Y$91,OR(D63=\"granulé\",D63=\"bois déchiqueté\"),$Y$90,OR(D63=\"fioul\",D63=\"gaz naturel\",D63=\"propane\"),$Y$92))*VLOOKUP(D63,$Y$7:$Z$12,2))","v":0},0,0,{"$error":"#NUM!"},{"$error":"#NUM!"},{"$error":"#NUM!"},{"$error":"#NUM!"},{"$error":"#NUM!"},{"$error":"#NUM!"},{"$error":"#NUM!"}]
[null,"DN400",0,{"$f":"SUM(C174:C176)","v":0},1300,0,null,21,50,"DN125",42.49,35.85,null,30.9,null,null,"TOTAL",{"$f":"SUM(R149:R173)","v":0},{"$f":"SUM(S149:S173)","v":0},{"$f":"SUM(T149:T173)","v":0},{"$f":"SUM(U149:U173)","v":0},{"$f":"SUM(V149:V173)","v":0},null,null,{"$f":"SUM(Y149:Y173)","v":0},0,0,{"$error":"#NUM!"},{"$error":"#NUM!"},{"$error":"#NUM!"},{"$error":"#NUM!"}]
[null,"DN350",0,null,1200,0,null,51,80,"DN150",49.57,40.58,null,33.86]
[null,"DN300",0,null,1100,0,null,81,150,"DN200",54.3,43.02,null,35.61]
[null,"DN250",0,{"$f":"SUM(C177:C179)","v":0},1000,0,null,151,400,"DN250",52.98,42.49,null,35.979999999999997]
[null,"DN200",0,null,900,{"$f":"C178*E178","v":0},null,null,null,null,null,null,null,null,null,null,"15/ Evolution des dépenses annuelles"]
[null,"DN150",0,null,800,0,null,null,null,null,null,null,null,null,null,null,null,"dépenses annuelles globales - projet bois",null,null,null,null,null,"dépenses annuelles globales - solution de référence",null,null,null,null,"delta","économies de fonctionnement",null,"dépenses globales cumulées",null,"dépenses de fonctionnement avec inv de départ"]
[null,"DN125",0,{"$f":"SUM(C180:C182)","v":0},700,0,null,null,null,null,null,null,null,null,null,null,null,"P1 bois","P1 appoint","P2+P3","fonctionnement bois","P4","total bois","P1","P2+P3","fonctionnement référence","P4","total référence",null,"par an","économies cumulées","Total cumulé bois","Total cumulé référence","Dépense cumulée bois (inv départ)","Dépense cumulée fossile (inv départ)"]
[null,"DN100",0,null,600,0,null,null,null,null,null,null,null,null,null,null,{"$f":"R8","v":" "},{"$f":"T129","v":0},{"$f":"T130","v":0},{"$f":"T131+T132","v":0},{"$f":"R181+S181+T181","v":0},{"$f":"IF(($Q$181+$Z$82)-Q181>0,$AB$82,0)+IF(($Q$181+$Z$83)-Q181>0,$AB$83,0)","v":{"$error":"#VALUE!"}},{"$f":"R181+T181+S181+V181","v":{"$error":"#VALUE!"}},{"$f":"U130","v":0},{"$f":"U131+U132","v":0},{"$f":"X181+Y181","v":0},{"$f":"IF(MAX($X$38:$X$62)-(Q181-$R$8)>0,$W$63,0)","v":{"$error":"#VALUE!"}},{"$f":"X181+Y181+AA181","v":{"$error":"#VALUE!"}},{"$f":"AB181-W181","v":{"$error":"#VALUE!"}},{"$f":"X181+Y181-R181-S181-T181","v":0},{"$f":"AD181","v":0},{"$f":"W181","v":{"$error":"#VALUE!"}},{"$f":"AB181","v":{"$error":"#VALUE!"}},{"$f":"$U$95+U181","v":0},{"$f":"$R$63+Z181","v":0}]
[null,"DN80",0,null,500,0,null,null,null,null,null,null,null,null,null,null,{"$f":"Q181+1","v":{"$error":"#VALUE!"}},{"$f":"R181*(1+Y$90)","v":0},{"$f":"S181*(1+Y$92)","v":0},{"$f":"IFERROR(T181*(1+($AB$75+$AB$76)/$AB$73*$Y$89+$AB$74/$AB$73*$Y$91),0)","v":0},{"$f":"R182+S182+T182","v":0},{"$error":"#VALUE!"},{"$f":"R182+T182+S182+V182","v":{"$error":"#VALUE!"}},{"$f":"X181*(1+Y$92)","v":0},{"$f":"Y181*(1+Y$89)","v":0},{"$f":"X182+Y182","v":0},{"$error":"#VALUE!"},{"$f":"X182+Y182+AA182","v":{"$error":"#VALUE!"}},{"$error":"#VALUE!"},0,{"$f":"AD182+AE181","v":0},{"$f":"AF181+W182","v":{"$error":"#VALUE!"}},{"$f":"AG181+AB182","v":{"$error":"#VALUE!"}},0,0]
[null,"DN65",0,{"$f":"SUM(C183:C189)","v":0},350,0,null,null,null,null,null,null,null,null,null,null,{"$f":"Q182+1","v":{"$error":"#VALUE!"}},0,0,{"$f":"IFERROR(T182*(1+($AB$75+$AB$76)/$AB$73*$Y$89+$AB$74/$AB$73*$Y$91),0)","v":0},{"$f":"R183+S183+T183","v":0},{"$error":"#VALUE!"},{"$f":"R183+T183+S183+V183","v":{"$error":"#VALUE!"}},0,0,{"$f":"X183+Y183","v":0},{"$error":"#VALUE!"},{"$f":"X183+Y183+AA183","v":{"$error":"#VALUE!"}},{"$error":"#VALUE!"},0,{"$f":"AD183+AE182","v":0},{"$f":"AF182+W183","v":{"$error":"#VALUE!"}},{"$f":"AG182+AB183","v":{"$error":"#VALUE!"}},0,0]
[null,"DN50",0,null,300,0,null,null,null,null,null,null,null,null,null,null,{"$f":"Q183+1","v":{"$error":"#VALUE!"}},0,0,0,0,{"$error":"#VALUE!"},{"$error":"#VALUE!"},0,0,0,{"$error":"#VALUE!"},{"$error":"#VALUE!"},{"$error":"#VALUE!"},0,{"$f":"AD184+AE183","v":0},{"$f":"AF183+W184","v":{"$error":"#VALUE!"}},{"$f":"AG183+AB184","v":{"$error":"#VALUE!"}},0,0]
[null,"DN40",0,null,250,0,null,null,null,null,null,null,null,null,null,null,{"$error":"#VALUE!"},0,0,0,0,{"$error":"#VALUE!"},{"$error":"#VALUE!"},0,0,0,{"$error":"#VALUE!"},{"$error":"#VALUE!"},{"$error":"#VALUE!"},0,0,{"$error":"#VALUE!"},{"$error":"#VALUE!"},0,0]
[null,"DN32",0,null,250,0,null,null,null,null,null,null,null,null,null,null,{"$error":"#VALUE!"},0,0,0,0,{"$error":"#VALUE!"},{"$error":"#VALUE!"},0,0,0,{"$error":"#VALUE!"},{"$error":"#VALUE!"},{"$error":"#VALUE!"},0,0,{"$error":"#VALUE!"},{"$error":"#VALUE!"},0,0]
[null,"DN25",0,null,250,0,null,null,null,null,null,null,null,null,null,null,{"$error":"#VALUE!"},0,0,0,0,{"$error":"#VALUE!"},{"$error":"#VALUE!"},0,0,0,{"$error":"#VALUE!"},{"$error":"#VALUE!"},{"$error":"#VALUE!"},0,0,{"$error":"#VALUE!"},{"$error":"#VALUE!"},0,0]
[null,"DN20",0,null,250,0,null,null,null,null,null,null,null,null,null,null,{"$error":"#VALUE!"},0,0,0,0,{"$error":"#VALUE!"},{"$error":"#VALUE!"},0,0,0,{"$error":"#VALUE!"},{"$error":"#VALUE!"},{"$error":"#VALUE!"},0,0,{"$error":"#VALUE!"},{"$error":"#VALUE!"},0,0]
[null,"DN15",0,null,250,0,null,null,null,null,null,null,null,null,null,null,{"$f":"Q188+1","v":{"$error":"#VALUE!"}},0,0,0,0,{"$error":"#VALUE!"},{"$error":"#VALUE!"},0,0,0,{"$error":"#VALUE!"},{"$error":"#VALUE!"},{"$error":"#VALUE!"},0,{"$f":"AD189+AE188","v":0},{"$f":"AF188+W189","v":{"$error":"#VALUE!"}},{"$f":"AG188+AB189","v":{"$error":"#VALUE!"}},0,0]
[null,null,"Total",{"$f":"SUM(D169:D183)","v":0},null,{"$f":"SUM(F169:F189)","v":0},null,null,null,null,null,null,null,null,null,null,{"$f":"Q189+1","v":{"$error":"#VALUE!"}},0,0,0,0,{"$error":"#VALUE!"},{"$error":"#VALUE!"},0,0,0,{"$error":"#VALUE!"},{"$error":"#VALUE!"},{"$error":"#VALUE!"},0,{"$f":"AD190+AE189","v":0},{"$f":"AF189+W190","v":{"$error":"#VALUE!"}},{"$f":"AG189+AB190","v":{"$error":"#VALUE!"}},0,0]
[null,null,null,null,null,null,null,null,null,null,null,null,null,null,null,null,{"$f":"Q190+1","v":{"$error":"#VALUE!"}},0,0,0,0,{"$error":"#VALUE!"},{"$error":"#VALUE!"},0,0,0,{"$error":"#VALUE!"},{"$error":"#VALUE!"},{"$error":"#VALUE!"},0,{"$f":"AD191+AE190","v":0},{"$f":"AF190+W191","v":{"$error":"#VALUE!"}},{"$f":"AG190+AB191","v":{"$error":"#VALUE!"}},0,0]
[null,null,null,null,null,null,null,null,null,null,null,null,null,null,null,null,{"$f":"Q191+1","v":{"$error":"#VALUE!"}},0,0,0,0,{"$error":"#VALUE!"},{"$error":"#VALUE!"},0,0,0,{"$error":"#VALUE!"},{"$error":"#VALUE!"},{"$error":"#VALUE!"},0,{"$f":"AD192+AE191","v":0},{"$f":"AF191+W192","v":{"$error":"#VALUE!"}},{"$f":"AG191+AB192","v":{"$error":"#VALUE!"}},0,0]
[null,null,null,null,null,null,null,null,null,null,null,null,null,null,null,null,{"$error":"#VALUE!"},0,0,0,0,{"$error":"#VALUE!"},{"$error":"#VALUE!"},0,0,0,{"$error":"#VALUE!"},{"$error":"#VALUE!"},{"$error":"#VALUE!"},0,0,{"$error":"#VALUE!"},{"$error":"#VALUE!"},0,0]
[null,"Type de bâtiment","Catégorisation pour fiche CEE","Surface par type de bâtiment","Fiche CEE BAT TH 127 < 400 kW",null,null,"Type de bâtiment","Catégorisation pour fiche CEE","Surface par type de bâtiment","Fiche CEE BAT TH 127 > 400 kW",null,null,null,null,null,{"$error":"#VALUE!"},0,0,0,0,{"$error":"#VALUE!"},{"$error":"#VALUE!"},0,0,0,{"$error":"#VALUE!"},{"$error":"#VALUE!"},{"$error":"#VALUE!"},0,0,{"$error":"#VALUE!"},{"$error":"#VALUE!"},0,0]
[null,null,null,null,"Coefficient chauffage","Coefficient chauffage + ECS",null,null,null,null,"Coefficient chauffage","Coefficient chauffage + ECS",null,null,null,null,{"$error":"#VALUE!"},0,0,0,0,{"$error":"#VALUE!"},{"$error":"#VALUE!"},0,0,0,{"$error":"#VALUE!"},{"$error":"#VALUE!"},{"$error":"#VALUE!"},0,0,{"$error":"#VALUE!"},{"$error":"#VALUE!"},0,0]
[null,{"$f":"'données d''entrée'!Y3","v":"Logements collectifs /Résidences étudiantes"},null,{"$f":"IFERROR(SUMIFS($E$9:$E$33,$B$9:$B$33,B196,$D$70:$D$94,\"<400\"),0)","v":0},{"$f":"'données d''entrée'!AA3","v":0},{"$f":"'données d''entrée'!AB3","v":0},null,{"$f":"'données d''entrée'!AE3","v":"Logements collectifs /Résidences étudiantes"},null,{"$f":"IFERROR(SUMIFS($E$9:$E$33,$B$9:$B$33,H196,$D$70:$D$94,\">400\"),0)","v":0},{"$f":"'données d''entrée'!AG3","v":0},{"$f":"'données d''entrée'!AH3","v":0},null,null,null,null,{"$error":"#VALUE!"},0,0,0,0,{"$error":"#VALUE!"},{"$error":"#VALUE!"},0,0,0,{"$error":"#VALUE!"},{"$error":"#VALUE!"},{"$error":"#VALUE!"},0,0,{"$error":"#VALUE!"},{"$error":"#VALUE!"},0,0]
[null,{"$f":"'données d''entrée'!Y4","v":" EHPAD"},"Santé",{"$f":"IFERROR(SUMIFS($E$9:$E$33,$B$9:$B$33,B197,$D$70:$D$94,\"<400\"),0)","v":0},{"$f":"'données d''entrée'!AA4","v":400},{"$f":"'données d''entrée'!AB4","v":540},null,{"$f":"'données d''entrée'!AE4","v":" EHPAD"},"Santé",{"$f":"IFERROR(SUMIFS($E$9:$E$33,$B$9:$B$33,H197,$D$70:$D$94,\">400\"),0)","v":0},{"$f":"'données d''entrée'!AG4","v":310},{"$f":"'données d''entrée'!AH4","v":410},null,null,null,null,{"$error":"#VALUE!"},0,0,0,0,{"$error":"#VALUE!"},{"$error":"#VALUE!"},0,0,0,{"$error":"#VALUE!"},{"$error":"#VALUE!"},{"$error":"#VALUE!"},0,0,{"$error":"#VALUE!"},{"$error":"#VALUE!"},0,0]
[null,{"$f":"'données d''entrée'!Y5","v":"Maisons individuelles"},null,0,{"$f":"'données d''entrée'!AA5","v":0},{"$f":"'données d''entrée'!AB5","v":0},null,{"$f":"'données d''entrée'!AE5","v":"Maisons indivduelles"},null,0,{"$f":"'données d''entrée'!AG5","v":0},{"$f":"'données d''entrée'!AH5","v":0},null,null,null,null,{"$error":"#VALUE!"},0,0,0,0,{"$error":"#VALUE!"},{"$error":"#VALUE!"},0,0,0,{"$error":"#VALUE!"},{"$error":"#VALUE!"},{"$error":"#VALUE!"},0,0,{"$error":"#VALUE!"},{"$error":"#VALUE!"},0,0]
[null,{"$f":"'données d''entrée'!Y6","v":"Bureaux"},"Bureaux",0,{"$f":"'données d''entrée'!AA6","v":480},{"$f":"'données d''entrée'!AB6","v":510},null,{"$f":"'données d''entrée'!AE6","v":"Bureaux"},"Bureaux",0,{"$f":"'données d''entrée'!AG6","v":370},{"$f":"'données d''entrée'!AH6","v":390},null,null,null,null,{"$error":"#VALUE!"},0,0,0,0,{"$error":"#VALUE!"},{"$error":"#VALUE!"},0,0,0,{"$error":"#VALUE!"},{"$error":"#VALUE!"},{"$error":"#VALUE!"},0,0,{"$error":"#VALUE!"},{"$error":"#VALUE!"},0,0]
[null,{"$f":"'données d''entrée'!Y7","v":" Lycées avec internat"},"Enseignement",0,{"$f":"'données d''entrée'!AA7","v":310},{"$f":"'données d''entrée'!AB7","v":360},null,{"$f":"'données d''entrée'!AE7","v":" Lycées avec internat"},"Enseignement",0,{"$f":"'données d''entrée'!AG7","v":240},{"$f":"'données d''entrée'!AH7","v":270},null,null,null,null,{"$error":"#VALUE!"},0,0,0,0,{"$error":"#VALUE!"},{"$error":"#VALUE!"},0,0,0,{"$error":"#VALUE!"},{"$error":"#VALUE!"},{"$error":"#VALUE!"},0,0,{"$error":"#VALUE!"},{"$error":"#VALUE!"},0,0]
[null,{"$f":"'données d''entrée'!Y8","v":"Crèches/ Écoles/ Collèges/ Lycée sans internat"},"Enseignement",0,{"$f":"'données d''entrée'!AA8","v":310},{"$f":"'données d''entrée'!AB8","v":360},null,{"$f":"'données d''entrée'!AE8","v":"Crèches/ Écoles/ Collèges/ Lycée sans internat"},"Enseignement",0,{"$f":"'données d''entrée'!AG8","v":240},{"$f":"'données d''entrée'!AH8","v":270},null,null,null,null,{"$error":"#VALUE!"},{"$f":"SUM(R181:R200)","v":0},0,0,0,{"$error":"#VALUE!"},{"$error":"#VALUE!"},0,0,0,{"$error":"#VALUE!"},{"$error":"#VALUE!"},{"$error":"#VALUE!"},0,0,{"$error":"#VALUE!"},{"$error":"#VALUE!"},0,0]
[null,{"$f":"'données d''entrée'!Y9","v":"Café / hôtels / restaurants"},"Hôtellerie/restauration",0,{"$f":"'données d''entrée'!AA4","v":400},{"$f":"'données d''entrée'!AB4","v":540},null,{"$f":"'données d''entrée'!AE9","v":"Café / hôtels / restaurants"},"Hôtellerie/restauration",0,{"$f":"'données d''entrée'!AG9","v":410},{"$f":"'données d''entrée'!AH9","v":520}]
[null,{"$f":"'données d''entrée'!Y10","v":"Hopitaux / cliniques"},"Santé",0,{"$f":"'données d''entrée'!AA10","v":400},{"$f":"'données d''entrée'!AB10","v":540},null,{"$f":"'données d''entrée'!AE10","v":"Hopitaux / cliniques"},"Santé",0,{"$f":"'données d''entrée'!AG10","v":310},{"$f":"'données d''entrée'!AH10","v":410}]
[null,{"$f":"'données d''entrée'!Y11","v":"Commerces"},"Commerces",0,{"$f":"'données d''entrée'!AA11","v":370},{"$f":"'données d''entrée'!AB11","v":420},null,{"$f":"'données d''entrée'!AE11","v":"Commerces"},"Commerces",0,{"$f":"'données d''entrée'!AG11","v":280},{"$f":"'données d''entrée'!AH11","v":320}]
[null,{"$f":"'données d''entrée'!Y12","v":"Sports, culture, Loisirs et Equipements sportifs (SCLE)"},"Autres",0,{"$f":"'données d''entrée'!AA12","v":310},{"$f":"'données d''entrée'!AB12","v":330},null,{"$f":"'données d''entrée'!AE12","v":"Sports, culture, Loisirs et Equipements sportifs (SCLE)"},"Autres",0,{"$f":"'données d''entrée'!AG12","v":240},{"$f":"'données d''entrée'!AH12","v":260},null,null,null,null,"Coût du MWh utile en année 5"]
[null,{"$f":"'données d''entrée'!Y13","v":"Piscine"},"Autres",0,{"$f":"'données d''entrée'!AA13","v":310},{"$f":"'données d''entrée'!AB13","v":330},null,{"$f":"'données d''entrée'!AE13","v":"Piscine"},"Autres",0,{"$f":"'données d''entrée'!AG13","v":240},{"$f":"'données d''entrée'!AH13","v":260}]
[null,{"$f":"'données d''entrée'!Y14","v":"Bâtiments tertiaires mixtes"},"Autres",0,{"$f":"'données d''entrée'!AA14","v":310},{"$f":"'données d''entrée'!AB14","v":330},null,{"$f":"'données d''entrée'!AE14","v":"Bâtiments tertiaires mixtes"},"Autres",0,{"$f":"'données d''entrée'!AG14","v":240},{"$f":"'données d''entrée'!AH14","v":260},null,null,null,null,null,"coût du MWh utile",null,"dépenses totales"]
[null,null,null,null,null,null,null,null,null,null,null,null,null,null,null,null,null,"bois","référence","bois","référence"]
[null,null,null,null,null,null,null,null,null,null,null,null,null,null,null,null,"P1 - énergie bois",{"$f":"IF($F$102=0,0,T209/$F$102)","v":0},{"$f":"IF($AY$39=0,0,U209/$F$102)","v":0},{"$f":"R186","v":0},0]
[null,null,null,null,null,null,null,null,null,null,null,null,null,null,null,null,"P1 - énergie appoint/ref",{"$f":"IF($F$102=0,0,T210/$F$102)","v":0},{"$f":"IF($AY$39=0,0,U210/$F$102)","v":0},{"$f":"S186","v":0},{"$f":"X186","v":0}]
[null,null,null,null,null,null,null,null,null,null,null,null,null,null,null,null,"P2 + P3 maintenance et GER",{"$f":"IF($F$102=0,0,T211/$F$102)","v":0},{"$f":"IF($AY$39=0,0,U211/$F$102)","v":0},{"$f":"T186","v":0},{"$f":"Y186","v":0}]
[]
[null,null,null,null,null,null,null,null,null,null,null,null,null,null,null,null,"P4 - amortissements",{"$f":"IF($F$102=0,0,T213/$F$102)","v":0},{"$f":"IF($AY$39=0,0,U213/$F$102)","v":0},{"$f":"V186","v":{"$error":"#VALUE!"}},{"$f":"AA186","v":{"$error":"#VALUE!"}}]
[null,null,null,null,null,null,null,null,null,null,null,null,null,null,null,null,"TOTAL",{"$f":"SUM(R209:R213)","v":0},{"$f":"SUM(S209:S213)","v":0},{"$f":"SUM(T209:T213)","v":{"$error":"#VALUE!"}},{"$f":"SUM(U209:U213)","v":{"$error":"#VALUE!"}}]
[null,null,null,null,null,null,null,null,null,null,null,null,null,null,null,null,{"$f":"IF(W7=\"oui\",IF(W8=\"oui\",\"\",\"TVA (si vente chaleur)\"),\"\")","v":""},{"$f":"IF(W7=\"oui\",IF(W8=\"oui\",\"\",0.055*R214),\"\")","v":""},{"$f":"IF(W7=\"oui\",IF(W8=\"oui\",\"\",0.2*S214),\"\")","v":""}]
[null,null,null,null,null,null,null,null,null,null,null,null,null,null,null,null,{"$f":"IF(W7=\"oui\",IF(W8=\"oui\",\"\",\"TOTAL TTC\"),\"\")","v":""},{"$f":"IF(W7=\"oui\",IF(W8=\"oui\",\"\",R214+R215),\"\")","v":""},{"$f":"IF(W7=\"oui\",IF(W8=\"oui\",\"\",S214+S215),\"\")","v":""}]

{"sheet":"Scénario 3","index":4,"n_rows":216,"n_cols":91,"rows_kept":216,"cut":false,"hidden":false,"merged":[[2,1,2,13],[2,16,2,28],[0,1,0,14],[0,16,0,28],[1,2,1,4],[1,5,1,6],[1,7,1,13],[98,16,98,20],[97,22,97,26],[66,1,66,14],[66,16,66,20],[66,22,66,27],[67,1,67,4],[70,24,70,25],[71,24,71,25],[95,1,95,13],[96,1,96,5],[96,8,96,13],[98,3,98,4],[86,23,86,24],[193,7,194,7],[193,8,194,8],[193,9,194,9],[193,10,193,11],[108,3,108,4],[177,16,177,34],[204,16,205,20],[109,3,109,4],[206,17,206,18],[206,19,206,20],[145,16,145,33],[122,16,122,34],[111,1,111,13],[193,1,194,1],[193,2,194,2],[193,3,194,3],[193,4,193,5],[122,1,122,14],[123,8,123,14],[165,3,165,4],[167,7,167,13],[5,1,5,14],[6,1,6,14],[36,1,36,9],[35,1,35,9],[65,16,65,27],[5,16,5,17],[5,19,5,22],[5,24,5,25],[6,19,6,21],[7,19,7,21],[8,19,8,21],[34,16,34,25]]}
[null,{"$f":"'données d''entrée'!E1","v":"installation d'une chaufferie bois  - [nom du projet] à [lieu du projet]"},null,null,null,null,null,null,null,null,null,null,null,null,null,null,{"$f":"B1","v":"installation d'une chaufferie bois  - [nom du projet] à [lieu du projet]"}]
[null,"Titre scénario :",{"$f":"TRIM(RIGHT(SUBSTITUTE(CELL(\"nomfichier\",B1),\"]\",REPT(\" \",100)),100))","v":"Scénario 3"},null,null,"Détail scénario: "]
[null,"PARTIE TECHNIQUE",null,null,null,null,null,null,null,null,null,null,null,null,null,null,"PARTIE ECONOMIQUE"]
[null,{"$f":"'données d''entrée'!D2","v":"Version 13 02/06/2026"}]
[]
[null,"1/ SITUATION ACTUELLE",null,null,null,null,null,null,null,null,null,null,null,null,null,null,"7/ PORTEUR DE PROJET",null,null,"8/ DEFINITION DU REGIME TVA",null,null,null,null,"9/ PRIX DES COMBUSTIBLES (€ HT/MWH)"]
[null,"Caractéristiques de l'installation",null,null,null,null,null,null,null,null,null,null,null,null,null,null,"qui est le maitre d'ouvrage du projet ?",{"$f":"IF('données d''entrée'!E4=0,\" \",'données d''entrée'!E4)","v":" "},null,"Y aura-t-il vente de chaleur à 2 abonnés minimum ?",null,null,null,null,"bois déchiqueté",{"$f":"IF('données d''entrée'!Q4=0,\" \",IF('Synthèse pour trame'!$B$82='Scénario 3'!Y7,'données d''entrée'!Q4*(1+'Synthèse pour trame'!$W$86),'données d''entrée'!Q4))","v":35},null,null,null,null,null,null,null,null,null,null,null,null,null,null,null,null,null,null,null,null,null,null,null,null,null,null,null,null,null,null,null,null,null,null,null,null,null,null,null,null,null,null,null,null,null,null,null,null,null,null,null,null,null,null,null,null,null,null,null,null,null,null,null,null,"test"]
[null,"Type de bâtiment","Nombre de logements si résidentiel collectif ou individuel","Bâtiment(s)","surface à chauffer (m2)","énergie actuelle utilisée","puissance installée (kW)","consommation moyenne sur 3 ans\n( chauffage + ECS ; MWh PCI)","Consommation d'ECS (si non connue, 0)","Rendement de production de référence","besoin utile ( chauffage + ECS ; MWh PCI)","Ratio de consommation énergétique de chauffage seul en kWh/m²","Révision ratio pour plafonnement","année installation","vétusté  actuelle",null,"Année de démarrage du projet ?",{"$f":"IF('données d''entrée'!E5=0,\" \",'données d''entrée'!E5)","v":" "},null,"Le client récupère-t-il la TVA?",null,null,null,null,"électricité",{"$f":"IF('données d''entrée'!Q5=0,\" \",IF('Synthèse pour trame'!$B$82='Scénario 3'!Y8,'données d''entrée'!Q5*(1+'Synthèse pour trame'!$W$86),'données d''entrée'!Q5))","v":200},null,null,null,null,null,null,null,null,null,null,null,null,null,null,null,null,null,null,null,null,null,null,null,null,null,null,null,null,null,null,null,null,null,null,null,null,null,null,null,null,null,null,null,null,null,null,null,null,null,null,null,null,null,null,null,null,null,null,null,null,null,null,null,null,{"$f":"IF(AE181>($U$95-$R$63),0,1)","v":1}]
[null,{"$f":"IF('données d''entrée'!B11=0,\" \",'données d''entrée'!B11)","v":" "},{"$f":"IF('données d''entrée'!C11=0,\" \",'données d''entrée'!C11)","v":" "},{"$f":"IF('données d''entrée'!D11=0,\" \",'données d''entrée'!D11)","v":" "},{"$f":"IF('données d''entrée'!E11=0,0,'données d''entrée'!E11)","v":0},{"$f":"IF('données d''entrée'!F11=0,\" \",'données d''entrée'!F11)","v":" "},{"$f":"IF('données d''entrée'!G11=0,\" \",'données d''entrée'!G11)","v":" "},{"$f":"IF('données d''entrée'!H11=0,\" \",'données d''entrée'!H11)","v":" "},{"$f":"IF('données d''entrée'!I11=0,0,'données d''entrée'!I11)","v":0},{"$f":"IF('données d''entrée'!J11=0,\" \",'données d''entrée'!J11)","v":" "},{"$f":"IF(OR(H9=\" \",J9=\" \"),\"\",(H9)*J9)","v":""},{"$f":"IF('données d''entrée'!L11=0,\" \",'données d''entrée'!L11)","v":""},{"$f":"IFERROR(_xlfn.IFS(\nAND(OR(B9=$B$197,B9=$B$199,B9=$B$200,B9=$B$201,B9=$B$202,B9=$B$203,B9=$B$204,B9=$B$205,B9=$B$207),L9>100),100,\nAND(OR(B9=$B$197,B9=$B$199,B9=$B$200,B9=$B$201,B9=$B$202,B9=$B$203,B9=$B$204,B9=$B$205,B9=$B$207),L9<=100),L9,\nAND(OR(B9=$B$196,B9=$B$198),L9>90),90,\nAND(OR(B9=$B$196,B9=$B$198),L9<=90),L9,\nOR(B9=\"\",B9=$B$206),L9),0)","v":0},{"$f":"IF('données d''entrée'!M11=0,\" \",'données d''entrée'!M11)","v":" "},{"$f":"IFERROR(IF(OR('données d''entrée'!N11<>0,AND('données d''entrée'!N11=0,N9-$R$8>=0)),'données d''entrée'!N11,\"\"),\"\")","v":""},{"$f":"IF(AND(E9<=7500,B9<>B196,B9<>B198),1,0)","v":1},{"$f":"IF(AND(C9<=125,OR(B9=C196,B9=C198)),1,0)","v":0},null,null,"Taux de TVA sur investissement si pas de récupération de TVA (/!\\ FCTVA 16,4%?) :",null,null,null,null,"fioul",{"$f":"IF('données d''entrée'!Q6=0,\" \",IF('Synthèse pour trame'!$B$82='Scénario 3'!Y9,'données d''entrée'!Q6*(1+'Synthèse pour trame'!$W$86),'données d''entrée'!Q6))","v":110},null,null,null,null,null,null,null,null,null,null,null,null,null,null,null,null,null,null,null,null,null,null,null,null,null,null,null,null,null,null,null,null,null,null,null,null,null,null,null,null,null,null,null,null,null,null,null,null,null,null,null,null,null,null,null,null,null,null,null,null,null,null,null,null,1]
[null,{"$f":"IF('données d''entrée'!B12=0,\" \",'données d''entrée'!B12)","v":" "},{"$f":"IF('données d''entrée'!C12=0,\" \",'données d''entrée'!C12)","v":" "},{"$f":"IF('données d''entrée'!D12=0,\" \",'données d''entrée'!D12)","v":" "},{"$f":"IF('données d''entrée'!E12=0,0,'données d''entrée'!E12)","v":0},{"$f":"IF('données d''entrée'!F12=0,\" \",'données d''entrée'!F12)","v":" "},{"$f":"IF('données d''entrée'!G12=0,\" \",'données d''entrée'!G12)","v":" "},{"$f":"IF('données d''entrée'!H12=0,\" \",'données d''entrée'!H12)","v":" "},{"$f":"IF('données d''entrée'!I12=0,0,'données d''entrée'!I12)","v":0},{"$f":"IF('données d''entrée'!J12=0,\" \",'données d''entrée'!J12)","v":" "},{"$f":"IF(OR(H10=\" \",J10=\" \"),\"\",(H10)*J10)","v":""},{"$f":"IF('données d''entrée'!L12=0,\" \",'données d''entrée'!L12)","v":""},{"$f":"IFERROR(_xlfn.IFS(\nAND(OR(B10=$B$197,B10=$B$199,B10=$B$200,B10=$B$201,B10=$B$202,B10=$B$203,B10=$B$204,B10=$B$205,B10=$B$207),L10>100),100,\nAND(OR(B10=$B$197,B10=$B$199,B10=$B$200,B10=$B$201,B10=$B$202,B10=$B$203,B10=$B$204,B10=$B$205,B10=$B$207),L10<=100),L10,\nAND(OR(B10=$B$196,B10=$B$198),L10>90),90,\nAND(OR(B10=$B$196,B10=$B$198),L10<=90),L10,\nOR(B10=\"\",B10=$B$206),L10),0)","v":0},{"$f":"IF('données d''entrée'!M12=0,\" \",'données d''entrée'!M12)","v":" "},{"$f":"IFERROR(IF(OR('données d''entrée'!N12<>0,AND('données d''entrée'!N12=0,N10-$R$8>=0)),'données d''entrée'!N12,\"\"),\"\")","v":""},{"$f":"IF(AND(E10<=7500,B10<>B197,B10<>B199),1,0)","v":1},{"$f":"IF(AND(C10<=125,OR(B10=C197,B10=C199)),1,0)","v":0},null,null,null,null,null,null,null,"gaz naturel",{"$f":"IF('données d''entrée'!Q7=0,\" \",IF('Synthèse pour trame'!$B$82='Scénario 3'!Y10,'données d''entrée'!Q7*(1+'Synthèse pour trame'!$W$86),'données d''entrée'!Q7))","v":100},null,null,null,null,null,null,null,null,null,null,null,null,null,null,null,null,null,null,null,null,null,null,null,null,null,null,null,null,null,null,null,null,null,null,null,null,null,null,null,null,null,null,null,null,null,null,null,null,null,null,null,null,null,null,null,null,null,null,null,null,null,null,null,null,1]
[null,{"$f":"IF('données d''entrée'!B13=0,\" \",'données d''entrée'!B13)","v":" "},{"$f":"IF('données d''entrée'!C13=0,\" \",'données d''entrée'!C13)","v":" "},{"$f":"IF('données d''entrée'!D13=0,\" \",'données d''entrée'!D13)","v":" "},{"$f":"IF('données d''entrée'!E13=0,0,'données d''entrée'!E13)","v":0},{"$f":"IF('données d''entrée'!F13=0,\" \",'données d''entrée'!F13)","v":" "},{"$f":"IF('données d''entrée'!G13=0,\" \",'données d''entrée'!G13)","v":" "},{"$f":"IF('données d''entrée'!H13=0,\" \",'données d''entrée'!H13)","v":" "},{"$f":"IF('données d''entrée'!I13=0,0,'données d''entrée'!I13)","v":0},{"$f":"IF('données d''entrée'!J13=0,\" \",'données d''entrée'!J13)","v":" "},"",{"$f":"IF('données d''entrée'!L13=0,\" \",'données d''entrée'!L13)","v":""},{"$f":"IFERROR(_xlfn.IFS(\nAND(OR(B11=$B$197,B11=$B$199,B11=$B$200,B11=$B$201,B11=$B$202,B11=$B$203,B11=$B$204,B11=$B$205,B11=$B$207),L11>100),100,\nAND(OR(B11=$B$197,B11=$B$199,B11=$B$200,B11=$B$201,B11=$B$202,B11=$B$203,B11=$B$204,B11=$B$205,B11=$B$207),L11<=100),L11,\nAND(OR(B11=$B$196,B11=$B$198),L11>90),90,\nAND(OR(B11=$B$196,B11=$B$198),L11<=90),L11,\nOR(B11=\"\",B11=$B$206),L11),0)","v":0},{"$f":"IF('données d''entrée'!M13=0,\" \",'données d''entrée'!M13)","v":" "},{"$f":"IFERROR(IF(OR('données d''entrée'!N13<>0,AND('données d''entrée'!N13=0,N11-$R$8>=0)),'données d''entrée'!N13,\"\"),\"\")","v":""},1,0,null,null,null,null,null,null,null,"granulé",{"$f":"IF('données d''entrée'!Q8=0,\" \",IF('Synthèse pour trame'!$B$82='Scénario 3'!Y11,'données d''entrée'!Q8*(1+'Synthèse pour trame'!$W$86),'données d''entrée'!Q8))","v":77},null,null,null,null,null,null,null,null,null,null,null,null,null,null,null,null,null,null,null,null,null,null,null,null,null,null,null,null,null,null,null,null,null,null,null,null,null,null,null,null,null,null,null,null,null,null,null,null,null,null,null,null,null,null,null,null,null,null,null,null,null,null,null,null,1]
[null,{"$f":"IF('données d''entrée'!B14=0,\" \",'données d''entrée'!B14)","v":" "},{"$f":"IF('données d''entrée'!C14=0,\" \",'données d''entrée'!C14)","v":" "},{"$f":"IF('données d''entrée'!D14=0,\" \",'données d''entrée'!D14)","v":" "},{"$f":"IF('données d''entrée'!E14=0,0,'données d''entrée'!E14)","v":0},{"$f":"IF('données d''entrée'!F14=0,\" \",'données d''entrée'!F14)","v":" "},{"$f":"IF('données d''entrée'!G14=0,\" \",'données d''entrée'!G14)","v":" "},{"$f":"IF('données d''entrée'!H14=0,\" \",'données d''entrée'!H14)","v":" "},{"$f":"IF('données d''entrée'!I14=0,0,'données d''entrée'!I14)","v":0},{"$f":"IF('données d''entrée'!J14=0,\" \",'données d''entrée'!J14)","v":" "},"",{"$f":"IF('données d''entrée'!L14=0,\" \",'données d''entrée'!L14)","v":""},{"$f":"IFERROR(_xlfn.IFS(\nAND(OR(B12=$B$197,B12=$B$199,B12=$B$200,B12=$B$201,B12=$B$202,B12=$B$203,B12=$B$204,B12=$B$205,B12=$B$207),L12>100),100,\nAND(OR(B12=$B$197,B12=$B$199,B12=$B$200,B12=$B$201,B12=$B$202,B12=$B$203,B12=$B$204,B12=$B$205,B12=$B$207),L12<=100),L12,\nAND(OR(B12=$B$196,B12=$B$198),L12>90),90,\nAND(OR(B12=$B$196,B12=$B$198),L12<=90),L12,\nOR(B12=\"\",B12=$B$206),L12),0)","v":0},{"$f":"IF('données d''entrée'!M14=0,\" \",'données d''entrée'!M14)","v":" "},{"$f":"IFERROR(IF(OR('données d''entrée'!N14<>0,AND('données d''entrée'!N14=0,N12-$R$8>=0)),'données d''entrée'!N14,\"\"),\"\")","v":""},1,0,null,null,null,null,null,null,null,"propane",{"$f":"IF('données d''entrée'!Q9=0,\" \",IF('Synthèse pour trame'!$B$82='Scénario 3'!Y12,'données d''entrée'!Q9*(1+'Synthèse pour trame'!$W$86),'données d''entrée'!Q9))","v":117},null,null,null,null,null,null,null,null,null,null,null,null,null,null,null,null,null,null,null,null,null,null,null,null,null,null,null,null,null,null,null,null,null,null,null,null,null,null,null,null,null,null,null,null,null,null,null,null,null,null,null,null,null,null,null,null,null,null,null,null,null,null,null,null,1]
[null,{"$f":"IF('données d''entrée'!B15=0,\" \",'données d''entrée'!B15)","v":" "},{"$f":"IF('données d''entrée'!C15=0,\" \",'données d''entrée'!C15)","v":" "},{"$f":"IF('données d''entrée'!D15=0,\" \",'données d''entrée'!D15)","v":" "},{"$f":"IF('données d''entrée'!E15=0,0,'données d''entrée'!E15)","v":0},{"$f":"IF('données d''entrée'!F15=0,\" \",'données d''entrée'!F15)","v":" "},{"$f":"IF('données d''entrée'!G15=0,\" \",'données d''entrée'!G15)","v":" "},{"$f":"IF('données d''entrée'!H15=0,\" \",'données d''entrée'!H15)","v":" "},{"$f":"IF('données d''entrée'!I15=0,0,'données d''entrée'!I15)","v":0},{"$f":"IF('données d''entrée'!J15=0,\" \",'données d''entrée'!J15)","v":" "},"",{"$f":"IF('données d''entrée'!L15=0,\" \",'données d''entrée'!L15)","v":""},{"$f":"IFERROR(_xlfn.IFS(\nAND(OR(B13=$B$197,B13=$B$199,B13=$B$200,B13=$B$201,B13=$B$202,B13=$B$203,B13=$B$204,B13=$B$205,B13=$B$207),L13>100),100,\nAND(OR(B13=$B$197,B13=$B$199,B13=$B$200,B13=$B$201,B13=$B$202,B13=$B$203,B13=$B$204,B13=$B$205,B13=$B$207),L13<=100),L13,\nAND(OR(B13=$B$196,B13=$B$198),L13>90),90,\nAND(OR(B13=$B$196,B13=$B$198),L13<=90),L13,\nOR(B13=\"\",B13=$B$206),L13),0)","v":0},{"$f":"IF('données d''entrée'!M15=0,\" \",'données d''entrée'!M15)","v":" "},{"$f":"IFERROR(IF(OR('données d''entrée'!N15<>0,AND('données d''entrée'!N15=0,N13-$R$8>=0)),'données d''entrée'!N15,\"\"),\"\")","v":""},1,0,null,null,null,null,null,null,null,null,null,null,null,null,null,null,null,null,null,null,null,null,null,null,null,null,null,null,null,null,null,null,null,null,null,null,null,null,null,null,null,null,null,null,null,null,null,null,null,null,null,null,null,null,null,null,null,null,null,null,null,null,null,null,null,null,null,null,null,null,null,null,null,null,null,1]
[null,{"$f":"IF('données d''entrée'!B16=0,\" \",'données d''entrée'!B16)","v":" "},{"$f":"IF('données d''entrée'!C16=0,\" \",'données d''entrée'!C16)","v":" "},{"$f":"IF('données d''entrée'!D16=0,\" \",'données d''entrée'!D16)","v":" "},{"$f":"IF('données d''entrée'!E16=0,0,'données d''entrée'!E16)","v":0},{"$f":"IF('données d''entrée'!F16=0,\" \",'données d''entrée'!F16)","v":" "},{"$f":"IF('données d''entrée'!G16=0,\" \",'données d''entrée'!G16)","v":" "},{"$f":"IF('données d''entrée'!H16=0,\" \",'données d''entrée'!H16)","v":" "},{"$f":"IF('données d''entrée'!I16=0,0,'données d''entrée'!I16)","v":0},{"$f":"IF('données d''entrée'!J16=0,\" \",'données d''entrée'!J16)","v":" "},"",{"$f":"IF('données d''entrée'!L16=0,\" \",'données d''entrée'!L16)","v":""},{"$f":"IFERROR(_xlfn.IFS(\nAND(OR(B14=$B$197,B14=$B$199,B14=$B$200,B14=$B$201,B14=$B$202,B14=$B$203,B14=$B$204,B14=$B$205,B14=$B$207),L14>100),100,\nAND(OR(B14=$B$197,B14=$B$199,B14=$B$200,B14=$B$201,B14=$B$202,B14=$B$203,B14=$B$204,B14=$B$205,B14=$B$207),L14<=100),L14,\nAND(OR(B14=$B$196,B14=$B$198),L14>90),90,\nAND(OR(B14=$B$196,B14=$B$198),L14<=90),L14,\nOR(B14=\"\",B14=$B$206),L14),0)","v":0},{"$f":"IF('données d''entrée'!M16=0,\" \",'données d''entrée'!M16)","v":" "},{"$f":"IFERROR(IF(OR('données d''entrée'!N16<>0,AND('données d''entrée'!N16=0,N14-$R$8>=0)),'données d''entrée'!N16,\"\"),\"\")","v":""},1,0,null,null,null,null,null,null,null,null,null,null,null,null,null,null,null,null,null,null,null,null,null,null,null,null,null,null,null,null,null,null,null,null,null,null,null,null,null,null,null,null,null,null,null,null,null,null,null,null,null,null,null,null,null,null,null,null,null,null,null,null,null,null,null,null,null,null,null,null,null,null,null,null,null,1]
[null,{"$f":"IF('données d''entrée'!B17=0,\" \",'données d''entrée'!B17)","v":" "},{"$f":"IF('données d''entrée'!C17=0,\" \",'données d''entrée'!C17)","v":" "},{"$f":"IF('données d''entrée'!D17=0,\" \",'données d''entrée'!D17)","v":" "},{"$f":"IF('données d''entrée'!E17=0,0,'données d''entrée'!E17)","v":0},{"$f":"IF('données d''entrée'!F17=0,\" \",'données d''entrée'!F17)","v":" "},{"$f":"IF('données d''entrée'!G17=0,\" \",'données d''entrée'!G17)","v":" "},{"$f":"IF('données d''entrée'!H17=0,\" \",'données d''entrée'!H17)","v":" "},{"$f":"IF('données d''entrée'!I17=0,0,'données d''entrée'!I17)","v":0},{"$f":"IF('données d''entrée'!J17=0,\" \",'données d''entrée'!J17)","v":" "},"",{"$f":"IF('données d''entrée'!L17=0,\" \",'données d''entrée'!L17)","v":""},{"$f":"IFERROR(_xlfn.IFS(\nAND(OR(B15=$B$197,B15=$B$199,B15=$B$200,B15=$B$201,B15=$B$202,B15=$B$203,B15=$B$204,B15=$B$205,B15=$B$207),L15>100),100,\nAND(OR(B15=$B$197,B15=$B$199,B15=$B$200,B15=$B$201,B15=$B$202,B15=$B$203,B15=$B$204,B15=$B$205,B15=$B$207),L15<=100),L15,\nAND(OR(B15=$B$196,B15=$B$198),L15>90),90,\nAND(OR(B15=$B$196,B15=$B$198),L15<=90),L15,\nOR(B15=\"\",B15=$B$206),L15),0)","v":0},{"$f":"IF('données d''entrée'!M17=0,\" \",'données d''entrée'!M17)","v":" "},{"$f":"IFERROR(IF(OR('données d''entrée'!N17<>0,AND('données d''entrée'!N17=0,N15-$R$8>=0)),'données d''entrée'!N17,\"\"),\"\")","v":""},1,0,null,null,null,null,null,null,null,null,null,null,null,null,null,null,null,null,null,null,null,null,null,null,null,null,null,null,null,null,null,null,null,null,null,null,null,null,null,null,null,null,null,null,null,null,null,null,null,null,null,null,null,null,null,null,null,null,null,null,null,null,null,null,null,null,null,null,null,null,null,null,null,null,null,1]
[null,{"$f":"IF('données d''entrée'!B18=0,\" \",'données d''entrée'!B18)","v":" "},{"$f":"IF('données d''entrée'!C18=0,\" \",'données d''entrée'!C18)","v":" "},{"$f":"IF('données d''entrée'!D18=0,\" \",'données d''entrée'!D18)","v":" "},{"$f":"IF('données d''entrée'!E18=0,0,'données d''entrée'!E18)","v":0},{"$f":"IF('données d''entrée'!F18=0,\" \",'données d''entrée'!F18)","v":" "},{"$f":"IF('données d''entrée'!G18=0,\" \",'données d''entrée'!G18)","v":" "},{"$f":"IF('données d''entrée'!H18=0,\" \",'données d''entrée'!H18)","v":" "},{"$f":"IF('données d''entrée'!I18=0,0,'données d''entrée'!I18)","v":0},{"$f":"IF('données d''entrée'!J18=0,\" \",'données d''entrée'!J18)","v":" "},"",{"$f":"IF('données d''entrée'!L18=0,\" \",'données d''entrée'!L18)","v":""},{"$f":"IFERROR(_xlfn.IFS(\nAND(OR(B16=$B$197,B16=$B$199,B16=$B$200,B16=$B$201,B16=$B$202,B16=$B$203,B16=$B$204,B16=$B$205,B16=$B$207),L16>100),100,\nAND(OR(B16=$B$197,B16=$B$199,B16=$B$200,B16=$B$201,B16=$B$202,B16=$B$203,B16=$B$204,B16=$B$205,B16=$B$207),L16<=100),L16,\nAND(OR(B16=$B$196,B16=$B$198),L16>90),90,\nAND(OR(B16=$B$196,B16=$B$198),L16<=90),L16,\nOR(B16=\"\",B16=$B$206),L16),0)","v":0},{"$f":"IF('données d''entrée'!M18=0,\" \",'données d''entrée'!M18)","v":" "},{"$f":"IFERROR(IF(OR('données d''entrée'!N18<>0,AND('données d''entrée'!N18=0,N16-$R$8>=0)),'données d''entrée'!N18,\"\"),\"\")","v":""},1,0,null,null,null,null,null,null,null,null,null,null,null,null,null,null,null,null,null,null,null,null,null,null,null,null,null,null,null,null,null,null,null,null,null,null,null,null,null,null,null,null,null,null,null,null,null,null,null,null,null,null,null,null,null,null,null,null,null,null,null,null,null,null,null,null,null,null,null,null,null,null,null,null,null,1]
[null,{"$f":"IF('données d''entrée'!B19=0,\" \",'données d''entrée'!B19)","v":" "},{"$f":"IF('données d''entrée'!C19=0,\" \",'données d''entrée'!C19)","v":" "},{"$f":"IF('données d''entrée'!D19=0,\" \",'données d''entrée'!D19)","v":" "},{"$f":"IF('données d''entrée'!E19=0,0,'données d''entrée'!E19)","v":0},{"$f":"IF('données d''entrée'!F19=0,\" \",'données d''entrée'!F19)","v":" "},{"$f":"IF('données d''entrée'!G19=0,\" \",'données d''entrée'!G19)","v":" "},{"$f":"IF('données d''entrée'!H19=0,\" \",'données d''entrée'!H19)","v":" "},{"$f":"IF('données d''entrée'!I19=0,0,'données d''entrée'!I19)","v":0},{"$f":"IF('données d''entrée'!J19=0,\" \",'données d''entrée'!J19)","v":" "},"",{"$f":"IF('données d''entrée'!L19=0,\" \",'données d''entrée'!L19)","v":""},{"$f":"IFERROR(_xlfn.IFS(\nAND(OR(B17=$B$197,B17=$B$199,B17=$B$200,B17=$B$201,B17=$B$202,B17=$B$203,B17=$B$204,B17=$B$205,B17=$B$207),L17>100),100,\nAND(OR(B17=$B$197,B17=$B$199,B17=$B$200,B17=$B$201,B17=$B$202,B17=$B$203,B17=$B$204,B17=$B$205,B17=$B$207),L17<=100),L17,\nAND(OR(B17=$B$196,B17=$B$198),L17>90),90,\nAND(OR(B17=$B$196,B17=$B$198),L17<=90),L17,\nOR(B17=\"\",B17=$B$206),L17),0)","v":0},{"$f":"IF('données d''entrée'!M19=0,\" \",'données d''entrée'!M19)","v":" "},{"$f":"IFERROR(IF(OR('données d''entrée'!N19<>0,AND('données d''entrée'!N19=0,N17-$R$8>=0)),'données d''entrée'!N19,\"\"),\"\")","v":""},1,0,null,null,null,null,null,null,null,null,null,null,null,null,null,null,null,null,null,null,null,null,null,null,null,null,null,null,null,null,null,null,null,null,null,null,null,null,null,null,null,null,null,null,null,null,null,null,null,null,null,null,null,null,null,null,null,null,null,null,null,null,null,null,null,null,null,null,null,null,null,null,null,null,null,1]
[null,{"$f":"IF('données d''entrée'!B20=0,\" \",'données d''entrée'!B20)","v":" "},{"$f":"IF('données d''entrée'!C20=0,\" \",'données d''entrée'!C20)","v":" "},{"$f":"IF('données d''entrée'!D20=0,\" \",'données d''entrée'!D20)","v":" "},{"$f":"IF('données d''entrée'!E20=0,0,'données d''entrée'!E20)","v":0},{"$f":"IF('données d''entrée'!F20=0,\" \",'données d''entrée'!F20)","v":" "},{"$f":"IF('données d''entrée'!G20=0,\" \",'données d''entrée'!G20)","v":" "},{"$f":"IF('données d''entrée'!H20=0,\" \",'données d''entrée'!H20)","v":" "},{"$f":"IF('données d''entrée'!I20=0,0,'données d''entrée'!I20)","v":0},{"$f":"IF('données d''entrée'!J20=0,\" \",'données d''entrée'!J20)","v":" "},"",{"$f":"IF('données d''entrée'!L20=0,\" \",'données d''entrée'!L20)","v":""},{"$f":"IFERROR(_xlfn.IFS(\nAND(OR(B18=$B$197,B18=$B$199,B18=$B$200,B18=$B$201,B18=$B$202,B18=$B$203,B18=$B$204,B18=$B$205,B18=$B$207),L18>100),100,\nAND(OR(B18=$B$197,B18=$B$199,B18=$B$200,B18=$B$201,B18=$B$202,B18=$B$203,B18=$B$204,B18=$B$205,B18=$B$207),L18<=100),L18,\nAND(OR(B18=$B$196,B18=$B$198),L18>90),90,\nAND(OR(B18=$B$196,B18=$B$198),L18<=90),L18,\nOR(B18=\"\",B18=$B$206),L18),0)","v":0},{"$f":"IF('données d''entrée'!M20=0,\" \",'données d''entrée'!M20)","v":" "},{"$f":"IFERROR(IF(OR('données d''entrée'!N20<>0,AND('données d''entrée'!N20=0,N18-$R$8>=0)),'données d''entrée'!N20,\"\"),\"\")","v":""},1,0,null,null,null,null,null,null,null,null,null,null,null,null,null,null,null,null,null,null,null,null,null,null,null,null,null,null,null,null,null,null,null,null,null,null,null,null,null,null,null,null,null,null,null,null,null,null,null,null,null,null,null,null,null,null,null,null,null,null,null,null,null,null,null,null,null,null,null,null,null,null,null,null,null,1]
[null,{"$f":"IF('données d''entrée'!B21=0,\" \",'données d''entrée'!B21)","v":" "},{"$f":"IF('données d''entrée'!C21=0,\" \",'données d''entrée'!C21)","v":" "},{"$f":"IF('données d''entrée'!D21=0,\" \",'données d''entrée'!D21)","v":" "},{"$f":"IF('données d''entrée'!E21=0,0,'données d''entrée'!E21)","v":0},{"$f":"IF('données d''entrée'!F21=0,\" \",'données d''entrée'!F21)","v":" "},{"$f":"IF('données d''entrée'!G21=0,\" \",'données d''entrée'!G21)","v":" "},{"$f":"IF('données d''entrée'!H21=0,\" \",'données d''entrée'!H21)","v":" "},{"$f":"IF('données d''entrée'!I21=0,0,'données d''entrée'!I21)","v":0},{"$f":"IF('données d''entrée'!J21=0,\" \",'données d''entrée'!J21)","v":" "},"",{"$f":"IF('données d''entrée'!L21=0,\" \",'données d''entrée'!L21)","v":""},{"$f":"IFERROR(_xlfn.IFS(\nAND(OR(B19=$B$197,B19=$B$199,B19=$B$200,B19=$B$201,B19=$B$202,B19=$B$203,B19=$B$204,B19=$B$205,B19=$B$207),L19>100),100,\nAND(OR(B19=$B$197,B19=$B$199,B19=$B$200,B19=$B$201,B19=$B$202,B19=$B$203,B19=$B$204,B19=$B$205,B19=$B$207),L19<=100),L19,\nAND(OR(B19=$B$196,B19=$B$198),L19>90),90,\nAND(OR(B19=$B$196,B19=$B$198),L19<=90),L19,\nOR(B19=\"\",B19=$B$206),L19),0)","v":0},{"$f":"IF('données d''entrée'!M21=0,\" \",'données d''entrée'!M21)","v":" "},{"$f":"IFERROR(IF(OR('données d''entrée'!N21<>0,AND('données d''entrée'!N21=0,N19-$R$8>=0)),'données d''entrée'!N21,\"\"),\"\")","v":""},1,0,null,null,null,null,null,null,null,null,null,null,null,null,null,null,null,null,null,null,null,null,null,null,null,null,null,null,null,null,null,null,null,null,null,null,null,null,null,null,null,null,null,null,null,null,null,null,null,null,null,null,null,null,null,null,null,null,null,null,null,null,null,null,null,null,null,null,null,null,null,null,null,null,null,1]
[null,{"$f":"IF('données d''entrée'!B22=0,\" \",'données d''entrée'!B22)","v":" "},{"$f":"IF('données d''entrée'!C22=0,\" \",'données d''entrée'!C22)","v":" "},{"$f":"IF('données d''entrée'!D22=0,\" \",'données d''entrée'!D22)","v":" "},{"$f":"IF('données d''entrée'!E22=0,0,'données d''entrée'!E22)","v":0},{"$f":"IF('données d''entrée'!F22=0,\" \",'données d''entrée'!F22)","v":" "},{"$f":"IF('données d''entrée'!G22=0,\" \",'données d''entrée'!G22)","v":" "},{"$f":"IF('données d''entrée'!H22=0,\" \",'données d''entrée'!H22)","v":" "},{"$f":"IF('données d''entrée'!I22=0,0,'données d''entrée'!I22)","v":0},{"$f":"IF('données d''entrée'!J22=0,\" \",'données d''entrée'!J22)","v":" "},"",{"$f":"IF('données d''entrée'!L22=0,\" \",'données d''entrée'!L22)","v":""},{"$f":"IFERROR(_xlfn.IFS(\nAND(OR(B20=$B$197,B20=$B$199,B20=$B$200,B20=$B$201,B20=$B$202,B20=$B$203,B20=$B$204,B20=$B$205,B20=$B$207),L20>100),100,\nAND(OR(B20=$B$197,B20=$B$199,B20=$B$200,B20=$B$201,B20=$B$202,B20=$B$203,B20=$B$204,B20=$B$205,B20=$B$207),L20<=100),L20,\nAND(OR(B20=$B$196,B20=$B$198),L20>90),90,\nAND(OR(B20=$B$196,B20=$B$198),L20<=90),L20,\nOR(B20=\"\",B20=$B$206),L20),0)","v":0},{"$f":"IF('données d''entrée'!M22=0,\" \",'données d''entrée'!M22)","v":" "},{"$f":"IFERROR(IF(OR('données d''entrée'!N22<>0,AND('données d''entrée'!N22=0,N20-$R$8>=0)),'données d''entrée'!N22,\"\"),\"\")","v":""},1,0,null,null,null,null,null,null,null,null,null,null,null,null,null,null,null,null,null,null,null,null,null,null,null,null,null,null,null,null,null,null,null,null,null,null,null,null,null,null,null,null,null,null,null,null,null,null,null,null,null,null,null,null,null,null,null,null,null,null,null,null,null,null,null,null,null,null,null,null,null,null,null,null,null,1]
[null,{"$f":"IF('données d''entrée'!B23=0,\" \",'données d''entrée'!B23)","v":" "},{"$f":"IF('données d''entrée'!C23=0,\" \",'données d''entrée'!C23)","v":" "},{"$f":"IF('données d''entrée'!D23=0,\" \",'données d''entrée'!D23)","v":" "},{"$f":"IF('données d''entrée'!E23=0,0,'données d''entrée'!E23)","v":0},{"$f":"IF('données d''entrée'!F23=0,\" \",'données d''entrée'!F23)","v":" "},{"$f":"IF('données d''entrée'!G23=0,\" \",'données d''entrée'!G23)","v":" "},{"$f":"IF('données d''entrée'!H23=0,\" \",'données d''entrée'!H23)","v":" "},{"$f":"IF('données d''entrée'!I23=0,0,'données d''entrée'!I23)","v":0},{"$f":"IF('données d''entrée'!J23=0,\" \",'données d''entrée'!J23)","v":" "},"",{"$f":"IF('données d''entrée'!L23=0,\" \",'données d''entrée'!L23)","v":""},{"$f":"IFERROR(_xlfn.IFS(\nAND(OR(B21=$B$197,B21=$B$199,B21=$B$200,B21=$B$201,B21=$B$202,B21=$B$203,B21=$B$204,B21=$B$205,B21=$B$207),L21>100),100,\nAND(OR(B21=$B$197,B21=$B$199,B21=$B$200,B21=$B$201,B21=$B$202,B21=$B$203,B21=$B$204,B21=$B$205,B21=$B$207),L21<=100),L21,\nAND(OR(B21=$B$196,B21=$B$198),L21>90),90,\nAND(OR(B21=$B$196,B21=$B$198),L21<=90),L21,\nOR(B21=\"\",B21=$B$206),L21),0)","v":0},{"$f":"IF('données d''entrée'!M23=0,\" \",'données d''entrée'!M23)","v":" "},{"$f":"IFERROR(IF(OR('données d''entrée'!N23<>0,AND('données d''entrée'!N23=0,N21-$R$8>=0)),'données d''entrée'!N23,\"\"),\"\")","v":""},1,0,null,null,null,null,null,null,null,null,null,null,null,null,null,null,null,null,null,null,null,null,null,null,null,null,null,null,null,null,null,null,null,null,null,null,null,null,null,null,null,null,null,null,null,null,null,null,null,null,null,null,null,null,null,null,null,null,null,null,null,null,null,null,null,null,null,null,null,null,null,null,null,null,null,1]
[null,{"$f":"IF('données d''entrée'!B24=0,\" \",'données d''entrée'!B24)","v":" "},{"$f":"IF('données d''entrée'!C24=0,\" \",'données d''entrée'!C24)","v":" "},{"$f":"IF('données d''entrée'!D24=0,\" \",'données d''entrée'!D24)","v":" "},{"$f":"IF('données d''entrée'!E24=0,0,'données d''entrée'!E24)","v":0},{"$f":"IF('données d''entrée'!F24=0,\" \",'données d''entrée'!F24)","v":" "},{"$f":"IF('données d''entrée'!G24=0,\" \",'données d''entrée'!G24)","v":" "},{"$f":"IF('données d''entrée'!H24=0,\" \",'données d''entrée'!H24)","v":" "},{"$f":"IF('données d''entrée'!I24=0,0,'données d''entrée'!I24)","v":0},{"$f":"IF('données d''entrée'!J24=0,\" \",'données d''entrée'!J24)","v":" "},"",{"$f":"IF('données d''entrée'!L24=0,\" \",'données d''entrée'!L24)","v":""},{"$f":"IFERROR(_xlfn.IFS(\nAND(OR(B22=$B$197,B22=$B$199,B22=$B$200,B22=$B$201,B22=$B$202,B22=$B$203,B22=$B$204,B22=$B$205,B22=$B$207),L22>100),100,\nAND(OR(B22=$B$197,B22=$B$199,B22=$B$200,B22=$B$201,B22=$B$202,B22=$B$203,B22=$B$204,B22=$B$205,B22=$B$207),L22<=100),L22,\nAND(OR(B22=$B$196,B22=$B$198),L22>90),90,\nAND(OR(B22=$B$196,B22=$B$198),L22<=90),L22,\nOR(B22=\"\",B22=$B$206),L22),0)","v":0},{"$f":"IF('données d''entrée'!M24=0,\" \",'données d''entrée'!M24)","v":" "},{"$f":"IFERROR(IF(OR('données d''entrée'!N24<>0,AND('données d''entrée'!N24=0,N22-$R$8>=0)),'données d''entrée'!N24,\"\"),\"\")","v":""},1,0,null,null,null,null,null,null,null,null,null,null,null,null,null,null,null,null,null,null,null,null,null,null,null,null,null,null,null,null,null,null,null,null,null,null,null,null,null,null,null,null,null,null,null,null,null,null,null,null,null,null,null,null,null,null,null,null,null,null,null,null,null,null,null,null,null,null,null,null,null,null,null,null,null,1]
[null,{"$f":"IF('données d''entrée'!B25=0,\" \",'données d''entrée'!B25)","v":" "},{"$f":"IF('données d''entrée'!C25=0,\" \",'données d''entrée'!C25)","v":" "},{"$f":"IF('données d''entrée'!D25=0,\" \",'données d''entrée'!D25)","v":" "},{"$f":"IF('données d''entrée'!E25=0,0,'données d''entrée'!E25)","v":0},{"$f":"IF('données d''entrée'!F25=0,\" \",'données d''entrée'!F25)","v":" "},{"$f":"IF('données d''entrée'!G25=0,\" \",'données d''entrée'!G25)","v":" "},{"$f":"IF('données d''entrée'!H25=0,\" \",'données d''entrée'!H25)","v":" "},{"$f":"IF('données d''entrée'!I25=0,0,'données d''entrée'!I25)","v":0},{"$f":"IF('données d''entrée'!J25=0,\" \",'données d''entrée'!J25)","v":" "},"",{"$f":"IF('données d''entrée'!L25=0,\" \",'données d''entrée'!L25)","v":""},{"$f":"IFERROR(_xlfn.IFS(\nAND(OR(B23=$B$197,B23=$B$199,B23=$B$200,B23=$B$201,B23=$B$202,B23=$B$203,B23=$B$204,B23=$B$205,B23=$B$207),L23>100),100,\nAND(OR(B23=$B$197,B23=$B$199,B23=$B$200,B23=$B$201,B23=$B$202,B23=$B$203,B23=$B$204,B23=$B$205,B23=$B$207),L23<=100),L23,\nAND(OR(B23=$B$196,B23=$B$198),L23>90),90,\nAND(OR(B23=$B$196,B23=$B$198),L23<=90),L23,\nOR(B23=\"\",B23=$B$206),L23),0)","v":0},{"$f":"IF('données d''entrée'!M25=0,\" \",'données d''entrée'!M25)","v":" "},{"$f":"IFERROR(IF(OR('données d''entrée'!N25<>0,AND('données d''entrée'!N25=0,N23-$R$8>=0)),'données d''entrée'!N25,\"\"),\"\")","v":""},1,0,null,null,null,null,null,null,null,null,null,null,null,null,null,null,null,null,null,null,null,null,null,null,null,null,null,null,null,null,null,null,null,null,null,null,null,null,null,null,null,null,null,null,null,null,null,null,null,null,null,null,null,null,null,null,null,null,null,null,null,null,null,null,null,null,null,null,null,null,null,null,null,null,null,1]
[null,{"$f":"IF('données d''entrée'!B26=0,\" \",'données d''entrée'!B26)","v":" "},{"$f":"IF('données d''entrée'!C26=0,\" \",'données d''entrée'!C26)","v":" "},{"$f":"IF('données d''entrée'!D26=0,\" \",'données d''entrée'!D26)","v":" "},{"$f":"IF('données d''entrée'!E26=0,0,'données d''entrée'!E26)","v":0},{"$f":"IF('données d''entrée'!F26=0,\" \",'données d''entrée'!F26)","v":" "},{"$f":"IF('données d''entrée'!G26=0,\" \",'données d''entrée'!G26)","v":" "},{"$f":"IF('données d''entrée'!H26=0,\" \",'données d''entrée'!H26)","v":" "},{"$f":"IF('données d''entrée'!I26=0,0,'données d''entrée'!I26)","v":0},{"$f":"IF('données d''entrée'!J26=0,\" \",'données d''entrée'!J26)","v":" "},"",{"$f":"IF('données d''entrée'!L26=0,\" \",'données d''entrée'!L26)","v":""},{"$f":"IFERROR(_xlfn.IFS(\nAND(OR(B24=$B$197,B24=$B$199,B24=$B$200,B24=$B$201,B24=$B$202,B24=$B$203,B24=$B$204,B24=$B$205,B24=$B$207),L24>100),100,\nAND(OR(B24=$B$197,B24=$B$199,B24=$B$200,B24=$B$201,B24=$B$202,B24=$B$203,B24=$B$204,B24=$B$205,B24=$B$207),L24<=100),L24,\nAND(OR(B24=$B$196,B24=$B$198),L24>90),90,\nAND(OR(B24=$B$196,B24=$B$198),L24<=90),L24,\nOR(B24=\"\",B24=$B$206),L24),0)","v":0},{"$f":"IF('données d''entrée'!M26=0,\" \",'données d''entrée'!M26)","v":" "},{"$f":"IFERROR(IF(OR('données d''entrée'!N26<>0,AND('données d''entrée'!N26=0,N24-$R$8>=0)),'données d''entrée'!N26,\"\"),\"\")","v":""},1,0,null,null,null,null,null,null,null,null,null,null,null,null,null,null,null,null,null,null,null,null,null,null,null,null,null,null,null,null,null,null,null,null,null,null,null,null,null,null,null,null,null,null,null,null,null,null,null,null,null,null,null,null,null,null,null,null,null,null,null,null,null,null,null,null,null,null,null,null,null,null,null,null,null,1]
[null,{"$f":"IF('données d''entrée'!B27=0,\" \",'données d''entrée'!B27)","v":" "},{"$f":"IF('données d''entrée'!C27=0,\" \",'données d''entrée'!C27)","v":" "},{"$f":"IF('données d''entrée'!D27=0,\" \",'données d''entrée'!D27)","v":" "},{"$f":"IF('données d''entrée'!E27=0,0,'données d''entrée'!E27)","v":0},{"$f":"IF('données d''entrée'!F27=0,\" \",'données d''entrée'!F27)","v":" "},{"$f":"IF('données d''entrée'!G27=0,\" \",'données d''entrée'!G27)","v":" "},{"$f":"IF('données d''entrée'!H27=0,\" \",'données d''entrée'!H27)","v":" "},{"$f":"IF('données d''entrée'!I27=0,0,'données d''entrée'!I27)","v":0},{"$f":"IF('données d''entrée'!J27=0,\" \",'données d''entrée'!J27)","v":" "},"",{"$f":"IF('données d''entrée'!L27=0,\" \",'données d''entrée'!L27)","v":""},{"$f":"IFERROR(_xlfn.IFS(\nAND(OR(B25=$B$197,B25=$B$199,B25=$B$200,B25=$B$201,B25=$B$202,B25=$B$203,B25=$B$204,B25=$B$205,B25=$B$207),L25>100),100,\nAND(OR(B25=$B$197,B25=$B$199,B25=$B$200,B25=$B$201,B25=$B$202,B25=$B$203,B25=$B$204,B25=$B$205,B25=$B$207),L25<=100),L25,\nAND(OR(B25=$B$196,B25=$B$198),L25>90),90,\nAND(OR(B25=$B$196,B25=$B$198),L25<=90),L25,\nOR(B25=\"\",B25=$B$206),L25),0)","v":0},{"$f":"IF('données d''entrée'!M27=0,\" \",'données d''entrée'!M27)","v":" "},{"$f":"IFERROR(IF(OR('données d''entrée'!N27<>0,AND('données d''entrée'!N27=0,N25-$R$8>=0)),'données d''entrée'!N27,\"\"),\"\")","v":""},1,0,null,null,null,null,null,null,null,null,null,null,null,null,null,null,null,null,null,null,null,null,null,null,null,null,null,null,null,null,null,null,null,null,null,null,null,null,null,null,null,null,null,null,null,null,null,null,null,null,null,null,null,null,null,null,null,null,null,null,null,null,null,null,null,null,null,null,null,null,null,null,null,null,null,1]
[null,{"$f":"IF('données d''entrée'!B28=0,\" \",'données d''entrée'!B28)","v":" "},{"$f":"IF('données d''entrée'!C28=0,\" \",'données d''entrée'!C28)","v":" "},{"$f":"IF('données d''entrée'!D28=0,\" \",'données d''entrée'!D28)","v":" "},{"$f":"IF('données d''entrée'!E28=0,0,'données d''entrée'!E28)","v":0},{"$f":"IF('données d''entrée'!F28=0,\" \",'données d''entrée'!F28)","v":" "},{"$f":"IF('données d''entrée'!G28=0,\" \",'données d''entrée'!G28)","v":" "},{"$f":"IF('données d''entrée'!H28=0,\" \",'données d''entrée'!H28)","v":" "},{"$f":"IF('données d''entrée'!I28=0,0,'données d''entrée'!I28)","v":0},{"$f":"IF('données d''entrée'!J28=0,\" \",'données d''entrée'!J28)","v":" "},"",{"$f":"IF('données d''entrée'!L28=0,\" \",'données d''entrée'!L28)","v":""},{"$f":"IFERROR(_xlfn.IFS(\nAND(OR(B26=$B$197,B26=$B$199,B26=$B$200,B26=$B$201,B26=$B$202,B26=$B$203,B26=$B$204,B26=$B$205,B26=$B$207),L26>100),100,\nAND(OR(B26=$B$197,B26=$B$199,B26=$B$200,B26=$B$201,B26=$B$202,B26=$B$203,B26=$B$204,B26=$B$205,B26=$B$207),L26<=100),L26,\nAND(OR(B26=$B$196,B26=$B$198),L26>90),90,\nAND(OR(B26=$B$196,B26=$B$198),L26<=90),L26,\nOR(B26=\"\",B26=$B$206),L26),0)","v":0},{"$f":"IF('données d''entrée'!M28=0,\" \",'données d''entrée'!M28)","v":" "},{"$f":"IFERROR(IF(OR('données d''entrée'!N28<>0,AND('données d''entrée'!N28=0,N26-$R$8>=0)),'données d''entrée'!N28,\"\"),\"\")","v":""},1,0,null,null,null,null,null,null,null,null,null,null,null,null,null,null,null,null,null,null,null,null,null,null,null,null,null,null,null,null,null,null,null,null,null,null,null,null,null,null,null,null,null,null,null,null,null,null,null,null,null,null,null,null,null,null,null,null,null,null,null,null,null,null,null,null,null,null,null,null,null,null,null,null,null,1]
[null,{"$f":"IF('données d''entrée'!B29=0,\" \",'données d''entrée'!B29)","v":" "},{"$f":"IF('données d''entrée'!C29=0,\" \",'données d''entrée'!C29)","v":" "},{"$f":"IF('données d''entrée'!D29=0,\" \",'données d''entrée'!D29)","v":" "},{"$f":"IF('données d''entrée'!E29=0,0,'données d''entrée'!E29)","v":0},{"$f":"IF('données d''entrée'!F29=0,\" \",'données d''entrée'!F29)","v":" "},{"$f":"IF('données d''entrée'!G29=0,\" \",'données d''entrée'!G29)","v":" "},{"$f":"IF('données d''entrée'!H29=0,\" \",'données d''entrée'!H29)","v":" "},{"$f":"IF('données d''entrée'!I29=0,0,'données d''entrée'!I29)","v":0},{"$f":"IF('données d''entrée'!J29=0,\" \",'données d''entrée'!J29)","v":" "},"",{"$f":"IF('données d''entrée'!L29=0,\" \",'données d''entrée'!L29)","v":""},{"$f":"IFERROR(_xlfn.IFS(\nAND(OR(B27=$B$197,B27=$B$199,B27=$B$200,B27=$B$201,B27=$B$202,B27=$B$203,B27=$B$204,B27=$B$205,B27=$B$207),L27>100),100,\nAND(OR(B27=$B$197,B27=$B$199,B27=$B$200,B27=$B$201,B27=$B$202,B27=$B$203,B27=$B$204,B27=$B$205,B27=$B$207),L27<=100),L27,\nAND(OR(B27=$B$196,B27=$B$198),L27>90),90,\nAND(OR(B27=$B$196,B27=$B$198),L27<=90),L27,\nOR(B27=\"\",B27=$B$206),L27),0)","v":0},{"$f":"IF('données d''entrée'!M29=0,\" \",'données d''entrée'!M29)","v":" "},{"$f":"IFERROR(IF(OR('données d''entrée'!N29<>0,AND('données d''entrée'!N29=0,N27-$R$8>=0)),'données d''entrée'!N29,\"\"),\"\")","v":""},1,0,null,null,null,null,null,null,null,null,null,null,null,null,null,null,null,null,null,null,null,null,null,null,null,null,null,null,null,null,null,null,null,null,null,null,null,null,null,null,null,null,null,null,null,null,null,null,null,null,null,null,null,null,null,null,null,null,null,null,null,null,null,null,null,null,null,null,null,null,null,null,null,null,null,{"$f":"SUM(CM8:CM26)+1","v":20}]
[null,{"$f":"IF('données d''entrée'!B30=0,\" \",'données d''entrée'!B30)","v":" "},{"$f":"IF('données d''entrée'!C30=0,\" \",'données d''entrée'!C30)","v":" "},{"$f":"IF('données d''entrée'!D30=0,\" \",'données d''entrée'!D30)","v":" "},{"$f":"IF('données d''entrée'!E30=0,0,'données d''entrée'!E30)","v":0},{"$f":"IF('données d''entrée'!F30=0,\" \",'données d''entrée'!F30)","v":" "},{"$f":"IF('données d''entrée'!G30=0,\" \",'données d''entrée'!G30)","v":" "},{"$f":"IF('données d''entrée'!H30=0,\" \",'données d''entrée'!H30)","v":" "},{"$f":"IF('données d''entrée'!I30=0,0,'données d''entrée'!I30)","v":0},{"$f":"IF('données d''entrée'!J30=0,\" \",'données d''entrée'!J30)","v":" "},"",{"$f":"IF('données d''entrée'!L30=0,\" \",'données d''entrée'!L30)","v":""},{"$f":"IFERROR(_xlfn.IFS(\nAND(OR(B28=$B$197,B28=$B$199,B28=$B$200,B28=$B$201,B28=$B$202,B28=$B$203,B28=$B$204,B28=$B$205,B28=$B$207),L28>100),100,\nAND(OR(B28=$B$197,B28=$B$199,B28=$B$200,B28=$B$201,B28=$B$202,B28=$B$203,B28=$B$204,B28=$B$205,B28=$B$207),L28<=100),L28,\nAND(OR(B28=$B$196,B28=$B$198),L28>90),90,\nAND(OR(B28=$B$196,B28=$B$198),L28<=90),L28,\nOR(B28=\"\",B28=$B$206),L28),0)","v":0},{"$f":"IF('données d''entrée'!M30=0,\" \",'données d''entrée'!M30)","v":" "},{"$f":"IFERROR(IF(OR('données d''entrée'!N30<>0,AND('données d''entrée'!N30=0,N28-$R$8>=0)),'données d''entrée'!N30,\"\"),\"\")","v":""},1,0]
[null,{"$f":"IF('données d''entrée'!B31=0,\" \",'données d''entrée'!B31)","v":" "},{"$f":"IF('données d''entrée'!C31=0,\" \",'données d''entrée'!C31)","v":" "},{"$f":"IF('données d''entrée'!D31=0,\" \",'données d''entrée'!D31)","v":" "},{"$f":"IF('données d''entrée'!E31=0,0,'données d''entrée'!E31)","v":0},{"$f":"IF('données d''entrée'!F31=0,\" \",'données d''entrée'!F31)","v":" "},{"$f":"IF('données d''entrée'!G31=0,\" \",'données d''entrée'!G31)","v":" "},{"$f":"IF('données d''entrée'!H31=0,\" \",'données d''entrée'!H31)","v":" "},{"$f":"IF('données d''entrée'!I31=0,0,'données d''entrée'!I31)","v":0},{"$f":"IF('données d''entrée'!J31=0,\" \",'données d''entrée'!J31)","v":" "},"",{"$f":"IF('données d''entrée'!L31=0,\" \",'données d''entrée'!L31)","v":""},{"$f":"IFERROR(_xlfn.IFS(\nAND(OR(B29=$B$197,B29=$B$199,B29=$B$200,B29=$B$201,B29=$B$202,B29=$B$203,B29=$B$204,B29=$B$205,B29=$B$207),L29>100),100,\nAND(OR(B29=$B$197,B29=$B$199,B29=$B$200,B29=$B$201,B29=$B$202,B29=$B$203,B29=$B$204,B29=$B$205,B29=$B$207),L29<=100),L29,\nAND(OR(B29=$B$196,B29=$B$198),L29>90),90,\nAND(OR(B29=$B$196,B29=$B$198),L29<=90),L29,\nOR(B29=\"\",B29=$B$206),L29),0)","v":0},{"$f":"IF('données d''entrée'!M31=0,\" \",'données d''entrée'!M31)","v":" "},{"$f":"IFERROR(IF(OR('données d''entrée'!N31<>0,AND('données d''entrée'!N31=0,N29-$R$8>=0)),'données d''entrée'!N31,\"\"),\"\")","v":""},1,0]
[null,{"$f":"IF('données d''entrée'!B32=0,\" \",'données d''entrée'!B32)","v":" "},{"$f":"IF('données d''entrée'!C32=0,\" \",'données d''entrée'!C32)","v":" "},{"$f":"IF('données d''entrée'!D32=0,\" \",'données d''entrée'!D32)","v":" "},{"$f":"IF('données d''entrée'!E32=0,0,'données d''entrée'!E32)","v":0},{"$f":"IF('données d''entrée'!F32=0,\" \",'données d''entrée'!F32)","v":" "},{"$f":"IF('données d''entrée'!G32=0,\" \",'données d''entrée'!G32)","v":" "},{"$f":"IF('données d''entrée'!H32=0,\" \",'données d''entrée'!H32)","v":" "},{"$f":"IF('données d''entrée'!I32=0,0,'données d''entrée'!I32)","v":0},{"$f":"IF('données d''entrée'!J32=0,\" \",'données d''entrée'!J32)","v":" "},"",{"$f":"IF('données d''entrée'!L32=0,\" \",'données d''entrée'!L32)","v":""},{"$f":"IFERROR(_xlfn.IFS(\nAND(OR(B30=$B$197,B30=$B$199,B30=$B$200,B30=$B$201,B30=$B$202,B30=$B$203,B30=$B$204,B30=$B$205,B30=$B$207),L30>100),100,\nAND(OR(B30=$B$197,B30=$B$199,B30=$B$200,B30=$B$201,B30=$B$202,B30=$B$203,B30=$B$204,B30=$B$205,B30=$B$207),L30<=100),L30,\nAND(OR(B30=$B$196,B30=$B$198),L30>90),90,\nAND(OR(B30=$B$196,B30=$B$198),L30<=90),L30,\nOR(B30=\"\",B30=$B$206),L30),0)","v":0},{"$f":"IF('données d''entrée'!M32=0,\" \",'données d''entrée'!M32)","v":" "},{"$f":"IFERROR(IF(OR('données d''entrée'!N32<>0,AND('données d''entrée'!N32=0,N30-$R$8>=0)),'données d''entrée'!N32,\"\"),\"\")","v":""},1,0]
[null,{"$f":"IF('données d''entrée'!B33=0,\" \",'données d''entrée'!B33)","v":" "},{"$f":"IF('données d''entrée'!C33=0,\" \",'données d''entrée'!C33)","v":" "},{"$f":"IF('données d''entrée'!D33=0,\" \",'données d''entrée'!D33)","v":" "},{"$f":"IF('données d''entrée'!E33=0,0,'données d''entrée'!E33)","v":0},{"$f":"IF('données d''entrée'!F33=0,\" \",'données d''entrée'!F33)","v":" "},{"$f":"IF('données d''entrée'!G33=0,\" \",'données d''entrée'!G33)","v":" "},{"$f":"IF('données d''entrée'!H33=0,\" \",'données d''entrée'!H33)","v":" "},{"$f":"IF('données d''entrée'!I33=0,0,'données d''entrée'!I33)","v":0},{"$f":"IF('données d''entrée'!J33=0,\" \",'données d''entrée'!J33)","v":" "},"",{"$f":"IF('données d''entrée'!L33=0,\" \",'données d''entrée'!L33)","v":""},{"$f":"IFERROR(_xlfn.IFS(\nAND(OR(B31=$B$197,B31=$B$199,B31=$B$200,B31=$B$201,B31=$B$202,B31=$B$203,B31=$B$204,B31=$B$205,B31=$B$207),L31>100),100,\nAND(OR(B31=$B$197,B31=$B$199,B31=$B$200,B31=$B$201,B31=$B$202,B31=$B$203,B31=$B$204,B31=$B$205,B31=$B$207),L31<=100),L31,\nAND(OR(B31=$B$196,B31=$B$198),L31>90),90,\nAND(OR(B31=$B$196,B31=$B$198),L31<=90),L31,\nOR(B31=\"\",B31=$B$206),L31),0)","v":0},{"$f":"IF('données d''entrée'!M33=0,\" \",'données d''entrée'!M33)","v":" "},{"$f":"IFERROR(IF(OR('données d''entrée'!N33<>0,AND('données d''entrée'!N33=0,N31-$R$8>=0)),'données d''entrée'!N33,\"\"),\"\")","v":""},1,0]
[null,{"$f":"IF('données d''entrée'!B34=0,\" \",'données d''entrée'!B34)","v":" "},{"$f":"IF('données d''entrée'!C34=0,\" \",'données d''entrée'!C34)","v":" "},{"$f":"IF('données d''entrée'!D34=0,\" \",'données d''entrée'!D34)","v":" "},{"$f":"IF('données d''entrée'!E34=0,0,'données d''entrée'!E34)","v":0},{"$f":"IF('données d''entrée'!F34=0,\" \",'données d''entrée'!F34)","v":" "},{"$f":"IF('données d''entrée'!G34=0,\" \",'données d''entrée'!G34)","v":" "},{"$f":"IF('données d''entrée'!H34=0,\" \",'données d''entrée'!H34)","v":" "},{"$f":"IF('données d''entrée'!I34=0,0,'données d''entrée'!I34)","v":0},{"$f":"IF('données d''entrée'!J34=0,\" \",'données d''entrée'!J34)","v":" "},"",{"$f":"IF('données d''entrée'!L34=0,\" \",'données d''entrée'!L34)","v":""},{"$f":"IFERROR(_xlfn.IFS(\nAND(OR(B32=$B$197,B32=$B$199,B32=$B$200,B32=$B$201,B32=$B$202,B32=$B$203,B32=$B$204,B32=$B$205,B32=$B$207),L32>100),100,\nAND(OR(B32=$B$197,B32=$B$199,B32=$B$200,B32=$B$201,B32=$B$202,B32=$B$203,B32=$B$204,B32=$B$205,B32=$B$207),L32<=100),L32,\nAND(OR(B32=$B$196,B32=$B$198),L32>90),90,\nAND(OR(B32=$B$196,B32=$B$198),L32<=90),L32,\nOR(B32=\"\",B32=$B$206),L32),0)","v":0},{"$f":"IF('données d''entrée'!M34=0,\" \",'données d''entrée'!M34)","v":" "},{"$f":"IFERROR(IF(OR('données d''entrée'!N34<>0,AND('données d''entrée'!N34=0,N32-$R$8>=0)),'données d''entrée'!N34,\"\"),\"\")","v":""},1,0]
[null,{"$f":"IF('données d''entrée'!B35=0,\" \",'données d''entrée'!B35)","v":" "},{"$f":"IF('données d''entrée'!C35=0,\" \",'données d''entrée'!C35)","v":" "},{"$f":"IF('données d''entrée'!D35=0,\" \",'données d''entrée'!D35)","v":" "},{"$f":"IF('données d''entrée'!E35=0,0,'données d''entrée'!E35)","v":0},{"$f":"IF('données d''entrée'!F35=0,\" \",'données d''entrée'!F35)","v":" "},{"$f":"IF('données d''entrée'!G35=0,\" \",'données d''entrée'!G35)","v":" "},{"$f":"IF('données d''entrée'!H35=0,\" \",'données d''entrée'!H35)","v":" "},{"$f":"IF('données d''entrée'!I35=0,0,'données d''entrée'!I35)","v":0},{"$f":"IF('données d''entrée'!J35=0,\" \",'données d''entrée'!J35)","v":" "},"",{"$f":"IF('données d''entrée'!L35=0,\" \",'données d''entrée'!L35)","v":""},{"$f":"IFERROR(_xlfn.IFS(\nAND(OR(B33=$B$197,B33=$B$199,B33=$B$200,B33=$B$201,B33=$B$202,B33=$B$203,B33=$B$204,B33=$B$205,B33=$B$207),L33>100),100,\nAND(OR(B33=$B$197,B33=$B$199,B33=$B$200,B33=$B$201,B33=$B$202,B33=$B$203,B33=$B$204,B33=$B$205,B33=$B$207),L33<=100),L33,\nAND(OR(B33=$B$196,B33=$B$198),L33>90),90,\nAND(OR(B33=$B$196,B33=$B$198),L33<=90),L33,\nOR(B33=\"\",B33=$B$206),L33),0)","v":0},{"$f":"IF('données d''entrée'!M35=0,\" \",'données d''entrée'!M35)","v":" "},{"$f":"IFERROR(IF(OR('données d''entrée'!N35<>0,AND('données d''entrée'!N35=0,N33-$R$8>=0)),'données d''entrée'!N35,\"\"),\"\")","v":""},1,0]
[null,null,null,null,{"$f":"SUM(E9:E33)","v":0},null,{"$f":"SUM(G9:G33)","v":0},{"$f":"SUM(H9:H33)","v":0},0,{"$f":"IFERROR(AVERAGE(J9:J33),0)","v":0},{"$f":"IFERROR(SUM(K9:K33),0)","v":0},{"$f":"IFERROR(AVERAGE(L9:L33),\"\")","v":""},null,null,{"$f":"(AVERAGE(O9:O33))","v":{"$error":"#DIV/0!"}}]
[null,null,null,null,null,null,null,null,null,null,null,null,null,null,null,null,"10/ CHIFFRAGE SCENARIO DE REFERENCE"]
[null,"2/ SCENARIO DE REFERENCE",null,null,null,null,null,null,null,null,null,null,null,null,null,null,"Caractéristiques de l'installation dans le Scénario de Référence"]
[null,"Caractéristiques de l'installation dans le Scénario de Référence",null,null,null,null,null,null,null,null,null,null,null,null,null,null,"Bâtiments",{"$f":"IF(OR(W8=\"oui\",W7=\"oui\"),\"investissement HTVA\",\"investissement TTC\")","v":"investissement TTC"},{"$f":"IF(OR(W8=\"oui\",W7=\"oui\"),\"Coût unitaire de l'énergie (€/MWh HTVA)\",\"Coût unitaire de l'énergie (€/MWh TTC)\")","v":"Coût unitaire de l'énergie (€/MWh TTC)"},{"$f":"IF(OR(W8=\"oui\",W7=\"oui\"),\"Coût de l'énergie annuelle P1 (€ HTVA)\",\"Coût de l'énergie annuelle P1 (€ TTC)\")","v":"Coût de l'énergie annuelle P1 (€ TTC)"},{"$f":"IF(OR(W8=\"oui\",W7=\"oui\"),\"Coût de maintenance annuelle P2 (€ HTVA)\",\"Coût de maintenance annuelle P2 (€ TTC)\")","v":"Coût de maintenance annuelle P2 (€ TTC)"},{"$f":"IF(OR(W8=\"oui\",W7=\"oui\"),\"GER P3 (€ HTVA)\",\"GER P3 (€ TTC)\")","v":"GER P3 (€ TTC)"},{"$f":"IF(OR(W8=\"oui\",W7=\"oui\"),\"Coût des annuités P4 (€ HTVA)\",\"Coût des annuités P4 (€ TTC)\")","v":"Coût des annuités P4 (€ TTC)"},"durée amortissement",{"$f":"IF(OR(W8=\"oui\",W7=\"oui\"),\"Dépenses d'exploitation totales référence (€ HTVA)\",\"Dépenses d'exploitation totales référence(€ TTC)\")","v":"Dépenses d'exploitation totales référence(€ TTC)"},{"$f":"IF(OR(W8=\"oui\",W7=\"oui\"),\"Coût par MWh (€ HTVA)\",\"Coût par MWh (€ TTC)\")","v":"Coût par MWh (€ TTC)"}]
[null,"Bâtiment(s)","Nature des travaux envisagés sur la production de chauffage","énergie de référence choisie","économies d'énergie (% de réduction)","puissance de référence (kW)","consommation moyenne sur 3 ans\n( chauffage + ECS ; MWh PCI)","Consommation d'ECS (si non connue, 0)","Rendement de production","besoin utile MWh",null,null,null,null,null,null,{"$f":"B39","v":" "},{"$f":"IFERROR(IF(F39=0,0,IF($C39=\"\",0,IF($F39=0,0,IF(OR($W$8=\"oui\",$W$7=\"oui\"),IF(N9-$R$8>=0,1,O9)*IF(AND($F39>9,$F39<151),0.57*$F39^2+76*$F39+2500,IF(AND($F39>150,$F39<951),56.1*$F39+18300,IF(AND($F39>950,$F39<14501),34.3*$F39+39000,IF($F39>14500,20.3*$F39+242000,\"\")))),O9*IF(AND($F39>9,$F39<151),0.57*$F39^2+76*$F39+2500,IF(AND($F39>150,$F39<951),56.1*$F39+18300,IF(AND($F39>950,$F39<14501),34.3*$F39+39000,IF($F39>14500,20.3*$F39+242000,\"\"))))*(1+$W$9)))))*1.3,0)","v":0},{"$f":"IF(OR(D39=\"à définir\",D39=\"\"),\"\",IF(OR($W$8=\"oui\",$W$7=\"oui\"),IF(D39=\"pac\",VLOOKUP(\"électricité\",$Y$7:$Z$12,2),VLOOKUP(D39,$Y$7:$Z$12,2)),IF(OR(D39=\"granulé\",D39=\"Bois déchiqueté\"),VLOOKUP(D39,$Y$7:$Z$12,2)*1.1,IF(D39=\"pac\",VLOOKUP(\"électricité\",$Y$7:$Z$12,2)*1.2,VLOOKUP(D39,$Y$7:$Z$12,2)*1.2))))","v":""},{"$f":"IF(S38=\"\",0,S38*G39)","v":0},{"$f":"IF(F39=\"\",0,IF(OR($W$8=\"oui\",$W$7=\"oui\"),IF(AND(F39>1,F39<8.99),250,IF(AND(F39>9,F39<96),0.18*F39^2-7.6*F39+300,IF(AND(F39>95,F39<951),6.6*F39+530,IF(AND(F39>950,F39<3501),F39+5800,IF(F39>3500,3.2*F39-1900,\"\"))))),IF(AND(F39>1,F39<8.99),250,IF(AND(F39>9,F39<96),0.18*F39^2-7.6*F39+300,IF(AND(F39>95,F39<951),6.6*F39+530,IF(AND(F39>950,F39<3501),F39+5800,IF(F39>3500,3.2*F39-1900,\"\")))))*(1+$W$9)))*1.3","v":0},{"$f":"0.01*R38","v":0},{"$f":"IFERROR(IF(X38=\"\",-PMT($AA$83,$Z$83,R38),-PMT($AA$83,X38,R38)),0)","v":0},null,{"$f":"W38+V38+U38+T38","v":0},{"$f":"IFERROR(IF(J39=0,0,Y38/J39),0)","v":0}]
[null,{"$f":"IF(D9=0,\"\",D9)","v":" "},null,null,{"$f":"IF('Synthèse pour trame'!$W$84<>0,'Synthèse pour trame'!$W$84,IF('Synthèse pour trame'!$W$80=\"Non\",0,'Synthèse pour trame'!$W$81))","v":0},null,{"$f":"IFERROR(IF(H9=0,0,(1-E39)*H9*J9/I39),\"\")","v":""},{"$f":"IFERROR(IF(K9=0,0,I9*J9/I39*(1-E39)),0)","v":0},{"$f":"IF(D39=\"PAC\",300%,IF(ISBLANK(D39)=TRUE,\"\",90%))","v":""},{"$f":"IFERROR(IF(K9=0,\"\",(G39)*I39),\"\")","v":""},null,null,null,null,null,null,{"$f":"B40","v":" "},{"$f":"IFERROR(IF(F40=0,0,IF($C40=\"\",0,IF($F40=0,0,IF(OR($W$8=\"oui\",$W$7=\"oui\"),IF(N10-$R$8>=0,1,O10)*IF(AND($F40>9,$F40<151),0.57*$F40^2+76*$F40+2500,IF(AND($F40>150,$F40<951),56.1*$F40+18300,IF(AND($F40>950,$F40<14501),34.3*$F40+39000,IF($F40>14500,20.3*$F40+242000,\"\")))),O10*IF(AND($F40>9,$F40<151),0.57*$F40^2+76*$F40+2500,IF(AND($F40>150,$F40<951),56.1*$F40+18300,IF(AND($F40>950,$F40<14501),34.3*$F40+39000,IF($F40>14500,20.3*$F40+242000,\"\"))))*(1+$W$9)))))*1.3,0)","v":0},"",{"$f":"IF(S39=\"\",0,S39*G40)","v":0},{"$f":"IF(F40=\"\",0,IF(OR($W$8=\"oui\",$W$7=\"oui\"),IF(AND(F40>1,F40<8.99),250,IF(AND(F40>9,F40<96),0.18*F40^2-7.6*F40+300,IF(AND(F40>95,F40<951),6.6*F40+530,IF(AND(F40>950,F40<3501),F40+5800,IF(F40>3500,3.2*F40-1900,\"\"))))),IF(AND(F40>1,F40<8.99),250,IF(AND(F40>9,F40<96),0.18*F40^2-7.6*F40+300,IF(AND(F40>95,F40<951),6.6*F40+530,IF(AND(F40>950,F40<3501),F40+5800,IF(F40>3500,3.2*F40-1900,\"\")))))*(1+$W$9)))*1.3","v":0},{"$f":"0.01*R39","v":0},0,null,{"$f":"W39+V39+U39+T39","v":0},{"$f":"IFERROR(IF(J40=0,0,Y39/J40),0)","v":0}]
[null," ",null,null,{"$f":"IF('Synthèse pour trame'!$W$84<>0,'Synthèse pour trame'!$W$84,IF('Synthèse pour trame'!$W$80=\"Non\",0,'Synthèse pour trame'!$W$81))","v":0},null,{"$f":"IFERROR(IF(H10=0,0,(1-E40)*H10*J10/I40),\"\")","v":""},{"$f":"IFERROR(IF(K10=0,0,I10*J10/I40*(1-E40)),0)","v":0},{"$f":"IF(D40=\"PAC\",300%,IF(ISBLANK(D40)=TRUE,\"\",90%))","v":""},{"$f":"IFERROR(IF(K10=0,\"\",(G40)*I40),\"\")","v":""},null,null,null,null,null,null," ",0,"",0,0,0,0,null,0,0]
[null," ",null,null,{"$f":"IF('Synthèse pour trame'!$W$84<>0,'Synthèse pour trame'!$W$84,IF('Synthèse pour trame'!$W$80=\"Non\",0,'Synthèse pour trame'!$W$81))","v":0},null,"",0,"","",null,null,null,null,null,null," ",0,"",0,0,0,0,null,0,0]
[null," ",null,null,{"$f":"IF('Synthèse pour trame'!$W$84<>0,'Synthèse pour trame'!$W$84,IF('Synthèse pour trame'!$W$80=\"Non\",0,'Synthèse pour trame'!$W$81))","v":0},null,"",0,"","",null,null,null,null,null,null," ",0,"",0,0,0,0,null,0,0]
[null," ",null,null,{"$f":"IF('Synthèse pour trame'!$W$84<>0,'Synthèse pour trame'!$W$84,IF('Synthèse pour trame'!$W$80=\"Non\",0,'Synthèse pour trame'!$W$81))","v":0},null,"",0,"","",null,null,null,null,null,null," ",0,"",0,0,0,0,null,0,0]
[null," ",null,null,{"$f":"IF('Synthèse pour trame'!$W$84<>0,'Synthèse pour trame'!$W$84,IF('Synthèse pour trame'!$W$80=\"Non\",0,'Synthèse pour trame'!$W$81))","v":0},null,"",0,"","",null,null,null,null,null,null," ",0,"",0,0,0,0,null,0,0]
[null," ",null,null,{"$f":"IF('Synthèse pour trame'!$W$84<>0,'Synthèse pour trame'!$W$84,IF('Synthèse pour trame'!$W$80=\"Non\",0,'Synthèse pour trame'!$W$81))","v":0},null,"",0,"","",null,null,null,null,null,null," ",0,"",0,0,0,0,null,0,0]
[null," ",null,null,{"$f":"IF('Synthèse pour trame'!$W$84<>0,'Synthèse pour trame'!$W$84,IF('Synthèse pour trame'!$W$80=\"Non\",0,'Synthèse pour trame'!$W$81))","v":0},null,"",0,"","",null,null,null,null,null,null," ",0,"",0,0,0,0,null,0,0]
[null," ",null,null,{"$f":"IF('Synthèse pour trame'!$W$84<>0,'Synthèse pour trame'!$W$84,IF('Synthèse pour trame'!$W$80=\"Non\",0,'Synthèse pour trame'!$W$81))","v":0},null,"",0,"","",null,null,null,null,null,null," ",0,"",0,0,0,0,null,0,0]
[null," ",null,null,{"$f":"IF('Synthèse pour trame'!$W$84<>0,'Synthèse pour trame'!$W$84,IF('Synthèse pour trame'!$W$80=\"Non\",0,'Synthèse pour trame'!$W$81))","v":0},null,"",0,"","",null,null,null,null,null,null," ",0,"",0,0,0,0,null,0,0]
[null," ",null,null,{"$f":"IF('Synthèse pour trame'!$W$84<>0,'Synthèse pour trame'!$W$84,IF('Synthèse pour trame'!$W$80=\"Non\",0,'Synthèse pour trame'!$W$81))","v":0},null,"",0,"","",null,null,null,null,null,null," ",0,"",0,0,0,0,null,0,0]
[null," ",null,null,{"$f":"IF('Synthèse pour trame'!$W$84<>0,'Synthèse pour trame'!$W$84,IF('Synthèse pour trame'!$W$80=\"Non\",0,'Synthèse pour trame'!$W$81))","v":0},null,"",0,"","",null,null,null,null,null,null," ",0,"",0,0,0,0,null,0,0]
[null," ",null,null,{"$f":"IF('Synthèse pour trame'!$W$84<>0,'Synthèse pour trame'!$W$84,IF('Synthèse pour trame'!$W$80=\"Non\",0,'Synthèse pour trame'!$W$81))","v":0},null,"",0,"","",null,null,null,null,null,null," ",0,"",0,0,0,0,null,0,0]
[null," ",null,null,{"$f":"IF('Synthèse pour trame'!$W$84<>0,'Synthèse pour trame'!$W$84,IF('Synthèse pour trame'!$W$80=\"Non\",0,'Synthèse pour trame'!$W$81))","v":0},null,"",0,"","",null,null,null,null,null,null," ",0,"",0,0,0,0,null,0,0]
[null," ",null,null,{"$f":"IF('Synthèse pour trame'!$W$84<>0,'Synthèse pour trame'!$W$84,IF('Synthèse pour trame'!$W$80=\"Non\",0,'Synthèse pour trame'!$W$81))","v":0},null,"",0,"","",null,null,null,null,null,null," ",0,"",0,0,0,0,null,0,0]
[null," ",null,null,{"$f":"IF('Synthèse pour trame'!$W$84<>0,'Synthèse pour trame'!$W$84,IF('Synthèse pour trame'!$W$80=\"Non\",0,'Synthèse pour trame'!$W$81))","v":0},null,"",0,"","",null,null,null,null,null,null," ",0,"",0,0,0,0,null,0,0]
[null," ",null,null,{"$f":"IF('Synthèse pour trame'!$W$84<>0,'Synthèse pour trame'!$W$84,IF('Synthèse pour trame'!$W$80=\"Non\",0,'Synthèse pour trame'!$W$81))","v":0},null,"",0,"","",null,null,null,null,null,null," ",0,"",0,0,0,0,null,0,0]
[null," ",null,null,{"$f":"IF('Synthèse pour trame'!$W$84<>0,'Synthèse pour trame'!$W$84,IF('Synthèse pour trame'!$W$80=\"Non\",0,'Synthèse pour trame'!$W$81))","v":0},null,"",0,"","",null,null,null,null,null,null," ",0,"",0,0,0,0,null,0,0]
[null," ",null,null,{"$f":"IF('Synthèse pour trame'!$W$84<>0,'Synthèse pour trame'!$W$84,IF('Synthèse pour trame'!$W$80=\"Non\",0,'Synthèse pour trame'!$W$81))","v":0},null,"",0,"","",null,null,null,null,null,null," ",0,"",0,0,0,0,null,0,0]
[null," ",null,null,{"$f":"IF('Synthèse pour trame'!$W$84<>0,'Synthèse pour trame'!$W$84,IF('Synthèse pour trame'!$W$80=\"Non\",0,'Synthèse pour trame'!$W$81))","v":0},null,"",0,"","",null,null,null,null,null,null," ",0,"",0,0,0,0,null,0,0]
[null," ",null,null,{"$f":"IF('Synthèse pour trame'!$W$84<>0,'Synthèse pour trame'!$W$84,IF('Synthèse pour trame'!$W$80=\"Non\",0,'Synthèse pour trame'!$W$81))","v":0},null,"",0,"","",null,null,null,null,null,null," ",0,"",0,0,0,0,null,0,{"$f":"IFERROR(IF(J60=0,0,Y59/J60),0)","v":0}]
[null," ",null,null,{"$f":"IF('Synthèse pour trame'!$W$84<>0,'Synthèse pour trame'!$W$84,IF('Synthèse pour trame'!$W$80=\"Non\",0,'Synthèse pour trame'!$W$81))","v":0},null,"",0,"","",null,null,null,null,null,null," ",0,"",0,0,0,0,null,0,0]
[null," ",null,null,{"$f":"IF('Synthèse pour trame'!$W$84<>0,'Synthèse pour trame'!$W$84,IF('Synthèse pour trame'!$W$80=\"Non\",0,'Synthèse pour trame'!$W$81))","v":0},null,"",0,"","",null,null,null,null,null,null," ",0,"",0,0,0,0,null,0,0]
[null," ",null,null,{"$f":"IF('Synthèse pour trame'!$W$84<>0,'Synthèse pour trame'!$W$84,IF('Synthèse pour trame'!$W$80=\"Non\",0,'Synthèse pour trame'!$W$81))","v":0},null,"",0,"","",null,null,null,null,null,null," ",0,"",0,0,0,0,null,0,0]
[null," ",null,null,{"$f":"IF('Synthèse pour trame'!$W$84<>0,'Synthèse pour trame'!$W$84,IF('Synthèse pour trame'!$W$80=\"Non\",0,'Synthèse pour trame'!$W$81))","v":0},null,"",0,"","",null,null,null,null,null,null,"Total",{"$f":"SUM(R38:R62)","v":0},null,{"$f":"SUM(T38:T62)","v":0},{"$f":"SUM(U38:U62)","v":0},{"$f":"SUM(V38:V62)","v":0},{"$f":"SUM(W38:W62)","v":0},null,{"$f":"SUM(Y38:Y62)","v":0}]
[null,null,null,null,"Total",{"$f":"SUM(F39:F63)","v":0},{"$f":"SUM(G39:G63)","v":0},{"$f":"SUM(H39:H63)","v":0},{"$f":"SUMPRODUCT(I39:I63,G39:G63)/G64","v":{"$error":"#DIV/0!"}},{"$f":"SUM(J39:J63)","v":0}]
[]
[null,null,null,null,null,null,null,null,null,null,null,null,null,null,null,null,"11/ CHIFFRAGE SCENARIO BOIS"]
[null,"3/ SCENARIO BOIS",null,null,null,null,null,null,null,null,null,null,null,null,null,null,"travaux à prévoir pour la solution Bois",null,null,null,null,null,{"$f":"IF(OR(W8=\"oui\",W7=\"oui\"),\"Détail des dépenses d'exploitation (€/MWh HTVA)\",\"Détail des dépenses d'exploitation (€/MWh TTC)\")","v":"Détail des dépenses d'exploitation (€/MWh TTC)"}]
[null,"Energie à fournir par bâtiment par la chaufferie bois ou le réseau",null,null,null,null,null,null,null,null,null,null,null,null,null,null,"postes de dépenses","caractéristiques",{"$f":"IF(OR(W8=\"oui\",W7=\"oui\"),\"investissement HTVA\",\"investissement TTC\")","v":"investissement TTC"},"taux subv.","solde",null,"MWh bois entrée chaufferie",null,null,null,null,{"$f":"C106","v":0}]
[null,"Bâtiment(s)","Nature des travaux envisagés sur la production de chauffage","puissance à fournir par la chaufferie bois ou la sous station (kW)","besoins utiles (MWh) sortie chaudière ou  livrés en sous station",null,null,null,null,null,null,null,null,null,null,null,"chaudière bois / puissance :",{"$f":"C99","v":0},null,{"$f":"U119","v":0},{"$f":"(1-T69)*S69","v":0},null,{"$f":"\"MWh fossile entrée chaufferie\"&IF(F114=\"Oui\",\"dont P1 géothermie\",\"\")","v":"MWh fossile entrée chaufferie"},null,null,null,null,{"$f":"C107+IF(F114=\"Oui\",F119,0)","v":0}]
[null,{"$f":"IF(D9=0,\"\",D9)","v":" "},null,{"$f":"IF(OR(I70=\"\",I70=0),F39,\"à préciser\")","v":0},{"$f":"IF(J39=\"\",0,IF(G39=\"\",0,J39))","v":0},null,null,null,null,null,null,null,null,null,null,null,"hydraulique et électricité en chaufferie",null,null,{"$f":"T69","v":0},0,null,"P1",null,null,null,null,{"$f":"SUM(AB71:AB72)","v":0}]
[null," ",null,{"$f":"IF(OR(I71=\"\",I71=0),F40,\"à préciser\")","v":0},0,null,null,null,null,null,null,null,null,null,null,null,"fumisterie",null,null,{"$f":"T69","v":0},0,null,"MWh bois entrée chaufferie - P1 bois",null,"coût du MWh bois :",null,{"$f":"IF(OR(C103=\"\",C103=\"à définir\"),\"définir le type de combustible en F40\",VLOOKUP(C103,Y7:Z12,2))","v":"définir le type de combustible en F40"},{"$f":"IF(OR(C103=\"\",C103=\"à définir\"),0,IF(OR($W$8=\"oui\",$W$7=\"oui\"),AB68*AA71,AB68*AA71*(1+0.1)))","v":0}]
[null," ",null,0,0,null,null,null,null,null,null,null,null,null,null,null,"traitement des fumées",null,null,{"$f":"T69","v":0},{"$f":"(1-T72)*S72","v":0},null,"MWh fossile entrée chaufferie - P1 appoint.",null,"coût du MWh appoint :",null,{"$f":"IF(C104=\"aucun\",\"\",IF(OR(C104=\"\",C104=\"à définir\"),\"définir le type de combustible en F41\",VLOOKUP(C104,Y7:Z12,2)))","v":"définir le type de combustible en F41"},{"$f":"IF(C104=\"aucun\",0,IF(OR(C104=\"\",C104=\"à définir\"),0,IF(OR($W$8=\"oui\",$W$7=\"oui\"),AB69*AA72,AB69*AA72*(1+$W$9))))","v":0}]
[null," ",null,0,0,null,null,null,null,null,null,null,null,null,null,null,"régulation",null,null,{"$f":"T69","v":0},{"$f":"(1-T73)*S73","v":0},null,"P2",null,null,null,null,{"$f":"SUM(AB74:AB77)","v":0}]
[null," ",null,0,0,null,null,null,null,null,null,null,null,null,null,null,"imprévus chaufferie bois",null,null,{"$f":"T70","v":0},{"$f":"(1-T74)*S74","v":0},null,"Electricité","% de la production",0.01,"coût du MWh électrique : ",{"$f":"Z8","v":200},{"$f":"IF(OR($W$8=\"oui\",$W$7=\"oui\"),S102*Y74*AA74,S102*Y74*AA74*(1+W9))","v":0}]
[null," ",null,0,0,null,null,null,null,null,null,null,null,null,null,null,"imprévus chaufferie bois - pour synthèse trame",null,{"$f":"IF('Synthèse pour trame'!W85<>0,V74*'Synthèse pour trame'!W85,0)","v":0},{"$f":"IF(S75<0,1,T69)","v":0},{"$f":"(1-T75)*S75","v":0},null,"Entretien courant premier niveau (interne)",null,{"$f":"IF(N102=0,0,(31*5*0.25)+(8*1.5)+(2*0.5)+(1*N102))","v":0},"heures","cout interne (45€/h)",{"$f":"Y75*45","v":0}]
[null," ",null,0,0,null,null,null,null,null,null,null,null,null,null,null,"Total équipements chaufferie bois",null,{"$f":"SUM(S69:S75)","v":0},null,{"$f":"SUM(U69:U75)","v":0},null,"contrat d'entretien maintenance",null,null,"ratio de coût de maintenance :",11,{"$f":"AA76*C99","v":0}]
[null," ",null,0,0,null,null,null,null,null,null,null,null,null,null,null,"trémie silo",null,null,{"$f":"T69","v":0},{"$f":"(1-T77)*S77","v":0},null,"Autres charges P2 (couplage)",null,null,null,null,{"$f":"IF(C114=\"Oui\",C119)+IF(F114=\"Oui\",F120)","v":0}]
[null," ",null,0,0,null,null,null,null,null,null,null,null,null,null,null,"voirie, vrd - surcout spécifique",null,0,{"$f":"T69","v":0},0,null,"P3",null,null,null,null,{"$f":"SUM(AB79:AB80)","v":0}]
[null," ",null,0,0,null,null,null,null,null,null,null,null,null,null,null,"génie civil et vrd classique",null,null,{"$f":"T69","v":0},0,null,"P3 gros entretien",null,0.01,null,null,{"$f":"IF(OR($W$8=\"oui\",$W$7=\"oui\"),Y79*(S76+S83+S85),Y79*(S76+S83+S85)*(1+W9))","v":0}]
[null," ",null,0,0,null,null,null,null,null,null,null,null,null,null,null,"Total batiment chaufferie bois",null,{"$f":"SUM(S77:S79)","v":0},null,{"$f":"SUM(U77:U79)","v":0},null,"Autres charges P3 (couplage)",null,null,null,null,{"$f":"IF(C114=\"Oui\",C120)+IF(F114=\"Oui\",F121)","v":0}]
[null," ",null,0,0,null,null,null,null,null,null,null,null,null,null,null,"chaudière d'appoint /                    puissance :",{"$f":"C100","v":0},{"$f":"R81*200","v":0},"non éligible",{"$f":"S81","v":0},null,"P4",null,null,"Durée de l'emprunt","Taux d'emprunt",{"$f":"SUM(AB82:AB83)","v":{"$error":"#NUM!"}}]
[null," ",null,0,0,null,null,null,null,null,null,null,null,null,null,null,"imprévus appoint",null,0,"non éligible",{"$f":"S82","v":0},null,"annuité lots techniques",null,"durée",null,null,{"$f":"-PMT(AA82,Z82,U76+U83+U85+U77)","v":{"$error":"#NUM!"}}]
[null," ",null,0,0,null,null,null,null,null,null,null,null,null,null,null,"Total appoint",null,{"$f":"SUM(S81:S82)","v":0},null,{"$f":"SUM(U81:U82)","v":0},null,"annuité lots gros œuvre",null,"durée",null,null,{"$f":"-PMT(AA83,Z83,U78+U79+U84+U86+U93)","v":{"$error":"#NUM!"}}]
[null," ",null,0,0,null,null,null,null,null,null,null,null,null,null,null,"réseau de chaleur /                           longueur : ",{"$f":"D190","v":0},{"$f":"F190","v":0},{"$f":"T69","v":0},{"$f":"IF(S84=0,0,(1-T84)*S84)","v":0}]
[null," ",null,0,0,null,null,null,null,null,null,null,null,null,null,null,"sous-stations /                                   nombre :",null,{"$f":"IF(R85=0,0,R85*13000+26*C98)","v":0},{"$f":"T70","v":0},{"$f":"IF(S85=0,0,(1-T85)*S85)","v":0}]
[null," ",null,0,0,null,null,null,null,null,null,null,null,null,null,null,"imprévus réseau",null,null,{"$f":"T71","v":0},0]
[null," ",null,0,0,null,null,null,null,null,null,null,null,null,null,null,"Total réseau",null,{"$f":"SUM(S84:S86)","v":0},null,{"$f":"SUM(U84:U86)","v":0},null,null,"ANALYSE DE SENSIBILITE"]
[null," ",null,0,0,null,null,null,null,null,null,null,null,null,null,null,"Total couplage(s)",{"$f":"IF(C114=\"Oui\",\"Solaire Thermique\",\"\")&\"/\"& IF(F114=\"Oui\",\"Géothermie\",\"\")","v":"/"},{"$f":"IF(C114=\"Oui\",C117)+IF(F114=\"Oui\",F117)","v":0},null,null,null,null,"Prix MWh cumac",{"$f":"'données d''entrée'!Q30","v":7.5}]
[null," ",null,0,0,null,null,null,null,null,null,null,null,null,null,null,"Total équipements (hors équipements secondaires)",null,{"$f":"S76+S80+S83+S87+S88","v":0},{"$f":"S89-U89","v":0},{"$f":"U76+U80+U83+U87","v":0},null,null,"Inflation maintenance :",{"$f":"IF('données d''entrée'!Q31=0,\" \",'données d''entrée'!Q31)","v":0.02}]
[null," ",null,0,0,null,null,null,null,null,null,null,null,null,null,null,null,null,null,null,null,null,null,"Inflation énergie bois :",{"$f":"IF('données d''entrée'!Q32=0,\" \",'données d''entrée'!Q32)","v":0.01}]
[null," ",null,0,0,null,null,null,null,null,null,null,null,null,null,null,"mision de maîtrise d'œuvre /                                   taux :",0.12,{"$f":"S89*R91","v":0},{"$f":"T69","v":0},{"$f":"(1-T91)*S91","v":0},null,null,"Inflation énergie électrique :",{"$f":"IF('données d''entrée'!Q33=0,\" \",'données d''entrée'!Q33)","v":0.04}]
[null," ",null,0,0,null,null,null,null,null,null,null,null,null,null,null,"imprévus étude et Moe",null,0,{"$f":"T69","v":0},0,null,null,"Inflation énergie fossile :",{"$f":"IF('données d''entrée'!Q34=0,\" \",'données d''entrée'!Q34)","v":0.03}]
[null," ",null,0,0,null,null,null,null,null,null,null,null,null,null,null,"total maitrise d'œuvre",{"$f":"S93/S89","v":{"$error":"#DIV/0!"}},{"$f":"SUM(S91:S92)","v":0},{"$f":"S93-U93","v":0},{"$f":"SUM(U91:U92)","v":0}]
[null," ",null,0,0]
[null,null,null,null,null,null,null,null,null,null,null,null,null,null,null,null,"coût Total  du projet",null,{"$f":"S93+S89","v":0},{"$f":"S95-U95","v":0},{"$f":"U89+U93","v":0},{"$f":"IF(S95>2000000,IF(S95/S102<=11,\"OK\",\"PAS D'EFFICIENCE ECONOMIQUE\"),\"\")","v":""}]
[null,"4/ DIMENSIONNEMENT CHAUFFERIE BOIS",null,null,null,null,null,null,null,null,null,null,null,null,null,null,"coût Total  du projet éligible",null,{"$f":"S76+S80+S87+S93","v":0}]
[null,"Caractéristique de l'installation bois",null,null,null,null,null,null,"Dimensionnement silo (facultatif)",null,null,null,null,null,null,null,"surcout du projet",null,{"$f":"S95-R63","v":0},null,{"$f":"U95-R63","v":0}]
[null,"Puissance totale délivrée (kW)",{"$f":"SUM(D70:D94)","v":0},null,null,null,null,null,"puissance bois",{"$f":"C99","v":0},"kW",null,null,null,null,null,null,null,null,null,null,null,"13/SYNTHESE SCENARIO BOIS / CRITERES ELIGIBILITE DU PBEB"]
[null,"Puissance Bois (kW)",null,"temps fonctionnement pleine puissance (heures)",null,{"$f":"IF(C99=0,0,C106*C109/C99*1000)","v":0},null,null,"autonomie pleine puissance",null,"jours",null,null,null,null,null,"12/ CALCUL DES AIDES pour la SOLUTION BOIS",null,null,null,null,"Coef coup de pouce TERTIAIRE","économie de fonctionnement annuelle après subvention, année 1 (hors annuités)",null,null,null,{"$f":"T63+U63+V63-AB70-AB73-AB78","v":0},null,"²"]
[null,"Puissance Appoint en chaufferie (kW)",null,null,null,null,null,null,"masse volumique du bois",{"$f":"IF(C103=\"bois déchiqueté\",IF(N100<35%,0.25,0.33),IF(C103=\"granulé\",0.6,\"renseigner en C59\"))","v":"renseigner en C59"},"tonne/m3","Humidité du bois : ",null,null,null,null,"Critères de calcul de l'aide:","Grande entreprise","Activité non économique","Collectif ou tertaire","Tertiaire",{"$f":"IFERROR((COUNTIF('Scénario 3'!$F$9:$F$33,\"gaz naturel\")*3+COUNTIF('Scénario 3'!$F$9:$F$33,\"fioul\")*4+COUNTIF('Scénario 3'!$F$9:$F$33,\"PAC\")*5+COUNTIF('Scénario 3'!$F$9:$F$33,\"propane\")*3+COUNTIF('Scénario 3'!$F$9:$F$33,\"PAC\")+COUNTIF('Scénario 3'!$F$9:$F$33,\"granulé\")+COUNTIF('Scénario 3'!$F$9:$F$35,\"bois déchiqueté\")+COUNTIF('Scénario 3'!$F$9:$F$35,\"électricité\"))/(COUNTIF('Scénario 3'!$F$9:$F$33,\"gaz naturel\")+COUNTIF('Scénario 3'!$F$9:$F$33,\"fioul\")+COUNTIF('Scénario 3'!$F$9:$F$33,\"PAC\")+COUNTIF('Scénario 3'!$F$9:$F$33,\"propane\")+COUNTIF('Scénario 3'!$F$9:$F$33,\"PAC\")+COUNTIF('Scénario 3'!$F$9:$F$33,\"granulé\")+COUNTIF('Scénario 3'!$F$9:$F$33,\"bois déchiqueté\")+COUNTIF('Scénario 3'!$F$9:$F$33,\"électricité\")),1)","v":1},"temps de retour avant subvention (ans)",null,null,null,{"$f":"IF(AA99=0,\"\",(S95-R63)/AA99)","v":""}]
[null,null,null,null,null,null,null,null,"PCI bois",{"$f":"(5080-58*N100*100)","v":5080},"KWh/tonne","volume par livraison :",null,null,null,null,"réseau de chaleur avec vente avec > 2 sous stations","<100%EnR","Projet sans gouvernance citoyenne","Projet chaufferie déchiqueté","Chauffage + ECS",null,"temps de retour, après subvention (ans)",null,null,null,{"$f":"IF(AA99=0,\"\",(U95-R63)/AA99)","v":""}]
[null,"besoins utiles livrés ou sortie chaud. (MWh)",null,null,null,{"$f":"ROUND(SUM(E70:E94)-IF(C114=\"Oui\",C118)-IF(F114=\"Oui\",F118),0)","v":0},null,null,"volume utile",{"$f":"J98*24*J99/J101/J100","v":{"$error":"#VALUE!"}},"m3","nombre de livraison :",null,{"$f":"IF(AND(ISNUMBER(J100)=TRUE,N101>0),ROUND(E106/J100/N101,0),0)","v":0},null,null,"MWh bois sorties chaudière :",null,{"$f":"F103/F110","v":0},null,{"$f":"CONCATENATE(\"soit \",ROUND(S102/11.63,0),\" tep\")","v":"soit 0 tep"},null,"temps de retour actualisé, après subvention (ans)",null,null,null,{"$f":"IF(CM27<=19,CM27,\">20 ans\")","v":">20 ans"}]
[null,"énergie bois prévue :",null,"taux de couverture bois :",null,{"$f":"E103*F102","v":0},null,null,"volume total",{"$f":"J102/N103","v":{"$error":"#VALUE!"}},"m3","taux de remplissage silo",null,null,null,null,"MWh bois éligibles (si plafonnement) :",null,{"$f":"IFERROR(IF(T101=\"Projet chaufferie granulé\",MIN(240,S102,SUMPRODUCT(_xlfn._xlws.FILTER(M9:M33,M9:M33>0),_xlfn._xlws.FILTER(E9:E33,E9:E33>0))/1000+I34*J34),MIN(S102,SUMPRODUCT(_xlfn._xlws.FILTER(M9:M33,M9:M33>0),_xlfn._xlws.FILTER(E9:E33,E9:E33>0))/1000+I34*J34)),0)","v":0},{"$f":"IFERROR(\"Eligible sur \"&IF(ROUND(S103/K34*100,0)>100,100,ROUND(S103/K34*100,0))&\"% des besoins globaux\",0)","v":0},null,null,"coût chaufferie bois par kW (€)",null,null,null,{"$f":"IF(C99=0,0,(S80+S76+S83)/C99)","v":0}]
[null,"énergie d'appoint prévue :",null,"taux de couverture appoint :",{"$f":"1-E103","v":1},{"$f":"E104*F102","v":0},{"$f":"IFERROR(IF(F104/C100>500,\"TROP D'APPOINT FOSSILE SI NEUF\",\"OK\"),\"\")","v":""},null,"Capacité utile",{"$f":"J102*J100","v":{"$error":"#VALUE!"}},"tonnes",null,null,null,null,null,null,null,"aide forfaitaire calculée sans plafond RGEC (plafond aide FC + CEE pris en compte)","aide retenue selon plafond RGEC",null,null,"coût réseau par ml (sous-station comprise) (€)",null,null,null,{"$f":"IF(OR(R84=0,R84=\"\"),\"\",(S84+S85+S86)/R84)","v":""}]
[null,null,null,null,null,null,null,null,"Capacité totale",{"$f":"J103*J100","v":{"$error":"#VALUE!"}},"tonnes",null,null,null,null,null,null,null,null,null,{"$f":"IF(S100=\"activité non économique\",\"% investissement\",\"% investissement (hors appoint)\")","v":"% investissement"},null,"chiffre d'affaire (hors marge)",null,null,null,{"$f":"V174","v":0}]
[null,"consommation bois entrée chaufferie",{"$f":"ROUND(F103/C109/F110,0)","v":0},"soit ",{"$f":"C106*1000/(5080-58*N100*100)","v":0},"tonnes",null,null,null,null,null,null,null,null,null,null,"1-Aide production de chaleur",null,{"$f":"SUM(S107:S110)","v":0},null,null,null,"tonnes de bois consommées",null,null,null,{"$f":"E106","v":0}]
[null,"consommation appoint entrée chaufferie",{"$f":"ROUND(F104/C110/F110,0)","v":0},null,null,null,null,null,null,null,null,null,null,null,null,null,"Aide ADEME - Fonds chaleur sans plafonnement CEE",{"$f":"IF(T100=\"Agricole, artisanal ou Industriel\",IF(S103<600,240*S103,IF(AND(S103>600,S103<3000),240*600+(S103-600)*120,IF(AND(S103>3000,S103<6000),240*600+120*2400+(S103-3000)*60,240*600+120*2400+60*3000+(S103-6000)*20))),IF(S103<600,420*S103,IF(AND(S103>600,S103<3000),420*600+(S103-600)*170,IF(AND(S103>3000,S103<6000),420*600+170*2400+(S103-3000)*80,420*600+170*2400+80*3000+(S103-6000)*50))))","v":0},null,null,null,null,"Origine du combustible",null,null,null,"granulés"]
[null,null,null,null,null,null,null,null,null,null,null,null,null,null,null,null,"Aide ADEME - Fonds chaleur après plafonnement CEE",null,{"$f":"IF(R107+R117>0.65*(S76+S80+S93),IF(0.65*(S76+S80+S93)-R117<0,0,0.65*(S76+S80+S93)-R117),R107)","v":0},null,null,null,"tep EnR consommées",null,null,null,{"$f":"C106/11.63","v":0}]
[null,"rendement production bois",0.82,"pertes réseaux et sous-stations",null,{"$f":"IF(G109=\"isolation standard\",ROUND(L166*220*24/1000,0), IF(G109=\"isolation +\",ROUND(N166*220*24/1000,0), ROUND(O166*220*24/1000,0)))","v":0},"Isolation standard",null,null,null,null,null,null,null,null,null,"autre aide (FEDER, DSIL ...)",null,0,null,null,null,"tep substituées",null,null,null,{"$f":"(G64-C107)/11.63","v":0}]
[null,"rendement production appoint",0.9,"rendement réseau et sous-stations",null,{"$f":"IF(F109=0,1,(F102)/(F102+F109))","v":1},null,null,null,null,null,null,null,null,null,null,"autre aide (FEDER, DSIL ...)",null,0,null,null,null,"investissement par tep substituée (€)",null,null,null,{"$f":"IF(AA109=0,0,S89/AA109)","v":0}]
[null,null,null,null,null,null,null,null,null,null,null,null,null,null,null,null,"2-Aide réseau de chaleur",null,{"$f":"SUM(S112:S114)","v":0},null,null,null,"tonnes de CO2 évitées/an",null,null,null,{"$f":"SUMIF(D39:G63,\"électricité\",G39:G63)*0.181+SUMIF(D39:G63,\"fioul\",G39:G63)*0.266+SUMIF(D39:G63,\"gaz naturel\",G39:G63)*0.187+SUMIF(D39:G63,\"propane\",G39:G63)*0.232","v":0}]
[null,"5/ COUPLAGE AVEC UNE AUTRE ENR",null,null,null,null,null,null,null,null,null,null,null,null,null,null,"Aide ADEME - Fonds chaleur",null,{"$f":"IF(AA114<1,0,MIN(S87,390*D183+450*D180+610*D177+770*D174+1190*D169))","v":0},null,null,null,"aide par tep substituée sortie chaudière",null,null,null,{"$f":"IF(AA109=0,0,S116/AA109)","v":0}]
[null,null,null,null,null,null,null,null,null,null,null,null,null,null,null,null,"autre aide (à préciser)",null,0,null,null,null,"emploi généré en équivalent temps plein",null,null,null,{"$f":"IF(AND(C99<1000,AA107=\"plaquettes bocagères\"),AA109*(11+1.8)/1000,IF(AND(C99<1000,AA107=\"plaquettes forestières\"),AA109*(1.8+6.4)/1000,IF(AND(C99<1000,AA107=\"plaquettes bois de fin de vie\"),AA109*(1.8+7.7)/1000,IF(AND(C99<1000,AA107=\"granulés\"),AA109*(1.8+1)/1000,IF(C99>1000,AA109*(1.1+6.4)/1000, )))))","v":0}]
[null,"Couplage avec du solaire thermique ?","Non",null,"Couplage avec du géothermie ?","Non",null,null,null,null,null,null,null,null,null,null,"autre aide (à préciser)",null,0,null,null,null,"chaleur livrée par ml de réseau (MWh)",null,null,null,{"$f":"IF(OR(R84=0,R84=\"\"),\"\",F102/R84)","v":""}]
[null,"Coût de l'investissement sans subvention (€)",null,null,"Coût de l'investissement subvention déduite (€)",null,null,null,null,null,null,null,null,null,null,null,"3-Bonus Citoyen Fond Chaleur",null,{"$f":"IF(S101=\"Projet à gouvernance citoyenne\",10%*(S108+S112),0)","v":0},null,null,null,"temps fonctionnement pleine puissance (heures)",null,null,null,{"$f":"IF(C99=0,0,C106*C109/C99*1000)","v":0}]
[null,"Montant de subvention (€)",null,null,"Coût de l'investissement subvention déduite (€)",null,null,null,null,null,null,null,null,null,null,null,"1 + 2 + 3 =Aides publiques totales",null,{"$f":"S111+S106+S115","v":0},{"$f":"IF(OR(Q101=\"chaufferie bois dédiée \",Q101=\"réseau technique\", Q101=\"réseau avec vente à 1 sous-station\"),IF(R100=\"grande entreprise\",MIN(S116,0.45*S96),IF(R100=\"moyenne entreprise\",MIN(S116,0.55*S96),IF(R100=\"petite entreprise\",MIN(S116,0.65*S96),IF(AND(R100=\"collectivité\",S100=\"activité économique\"),MIN(S116,0.65*S96),MIN(S116,0.8*S96))))),IF(Q101=\"réseau de chaleur avec vente avec > 2 sous stations\",MAX(T120,(IF(R101=\"<100%EnR\",IF(R100=\"grande entreprise\",MIN(S116,0.3*S96),IF(R100=\"moyenne entreprise\",MIN(S116,0.4*S96),MIN(S116,0.5*S96))),IF(R100=\"grande entreprise\",MIN(S116,(0.3+0.15)*S96),IF(R100=\"moyenne entreprise\",MIN(S116,(0.4+0.15)*S96),MIN(S116,(0.5+0.15)*S96))))))))","v":0},{"$f":"IF(S96=0,0,T116/(S96))","v":0},null,"CO2 en équivalents tours de la Terre en voiture",null,null,null,{"$f":"AA111*1000/0.16/40075","v":0}]
[null,"Coût de l'investissement subvention déduite (€)",{"$f":"IF(AND(C114=\"Oui\",$Q$101=\"réseau de chaleur avec vente avec > 2 sous stations\"),MIN($S$96/(T116+C116),0.65*$S$96),(C115-C116))","v":0},null,"Coût de l'investissement subvention déduite (€)",{"$f":"IF(AND(F114=\"Oui\",$Q$101=\"réseau de chaleur avec vente avec > 2 sous stations\"),MIN($S$96/(W115+F116),0.65*$S$96),(F115-F116))","v":0},null,null,null,null,null,null,null,null,null,null,"CEE changement chaudière :",{"$f":"IF(Q101=\"réseau de chaleur avec vente avec > 2 sous stations\",0,\nIF(U100=\"Tertiaire\",IF(C99<=500,4.8*F103,3.4*F103),IF(C99<=500,4.8*F103,3.4*F103)))*Y88","v":0},null,{"$f":"R117","v":0},null,null,"économie de fonctionnement supplémentaires injectée dans le territoire",null,null,null,{"$f":"AB71+0.2*AB72+0.9*AB76-0.2*T63-0.9*U63","v":0}]
[null,"Production EnR (MWh)",null,null,"Production EnR (MWh)",null,null,null,null,null,null,null,null,null,null,null,"CEE  raccordement RC /Nb de logements raccordés si résidentiel :",{"$f":"IF(OR(R117<>0,Q101<>\"réseau de chaleur avec vente avec > 2 sous stations\"),0,_xlfn.IFS(U100=\"Résidentiel individuel\",40.2*_xlfn.IFS(SUM($E$9:$E$33)<70,0.5,SUM($E$9:$E$33)<90,0.7,SUM($E$9:$E$33)<110,1,SUM($E$9:$E$33)<=130,1.1,SUM($E$9:$E$33)>130,1.6)*$Y$88,U100=\"Résidentiel collectif\",(SUMIF(C9:C33,\"<=125\")*24+COUNTIF(C9:C33,\"<=125\")*9000+(SUMIF(C9:C33,\">125\")*54+COUNTIF(C9:C33,\">125\")*5200))*$Y$88,U100=\"Tertiaire\",IF(U101=\"Chauffage seul \",SUMPRODUCT($D$196:$D$207,$E$196:$E$207)*0.9*$Y$88/1000+SUMPRODUCT($J$196:$J$207,$K$196:$K$207)*0.9*$Y$88/1000,SUMPRODUCT($D$196:$D$207,$F$196:$F$207)*0.9*$Y$88/1000)+SUMPRODUCT($J$196:$J$207,$L$196:$L$207)*0.9*$Y$88/1000))\n\n+ IF(AND(Q101=\"réseau de chaleur avec vente avec > 2 sous stations\",F102<>0),(SUMPRODUCT(P9:P33,E9:E33)*0.2+9500*SUM(P9:P33))*$Y$88+(SUMIF(E9:E33,\">7500\")*0.8+5000*COUNTIF(E9:E33,\">7500\"))*$Y$88\n+(SUMPRODUCT(Q9:Q33,C9:C33)*24+9000*SUM(Q9:Q33))*$Y$88+(SUMIF(C9:C33,\">125\")*54+5200*COUNTIF(E9:E33,\">125\"))*$Y$88,0)","v":0},null,{"$f":"R118","v":0}]
[null,"P2 (€)",null,null,"P1 (€)",null,null,null,null,null,null,null,null,null,null,null,"1  + 2 + 3 + CEE = Aides totales",null,{"$f":"S116+R117+R118","v":0},{"$f":"T116+T117+T118","v":0},{"$f":"IF(S96=0,0,IF(T119/(S96)>1,1,T119/(S96)))","v":0}]
[null,"P3 (€)",null,null,"P2 (€)",null,null,null,null,null,null,null,null,null,null,null,"Valeur à reporter à partir de la cellule A48 renseignée dans l'onglet \"déficit de financement\" :"]
[null,null,null,null,"P3 (€)"]
[]
[null,"6/ DIMENSIONNEMENT DIAMETRES RESEAU DE CHALEUR",null,null,null,null,null,null,null,null,null,null,null,null,null,null,"14/ COUT DU MWh"]
[null,null,null,null,null,null,null,null,"Réseau préisolé enterré 90/70 °C"]
[null,"tronçon","Longueur de tranchée (m)","Longueur canalisation A/R (m)","Puissance à livrer (KW)","DT °C","Débit m3/h","DN \n","Pertes W/ml\nisolation standard\nA+R","Pertes W/ml\nisolation +\nA+R","Pertes W/ml\nisolation ++\nA+R","Pertes kW\nisolation standard\nA+R",null,"Pertes kW\nisolation +\nA+R","Pertes kW\nisolation ++\nA+R",null,"Coût du MWh utile en année 1"]
[null,null,null,{"$f":"(C126*2)","v":0},null,20,{"$f":"(E126/(1.163*F126))","v":0},{"$f":"IF($G126=0,\"\",VLOOKUP($G126,$H$170:$N$177,3,TRUE))","v":""},{"$f":"IF($G126=0,\"\",VLOOKUP($G126,$H$170:$N$177,4,TRUE))","v":""},{"$f":"IF($G126=0,\"\",VLOOKUP($G126,$H$170:$N$177,5,TRUE))","v":""},{"$f":"IF($G126=0,\"\",VLOOKUP($G126,$H$170:$N$177,7,TRUE))","v":""},{"$f":"IF($C126=\"\",\"\",I126*$C126/1000)","v":""},null,{"$f":"IF($C126=\"\",\"\",J126*$C126/1000)","v":""},{"$f":"IF($C126=\"\",\"\",K126*$C126/1000)","v":""}]
[null,null,null,{"$f":"(C127*2)","v":0},null,20,{"$f":"(E127/(1.163*F127))","v":0},"","","",{"$f":"IF($G127=0,\"\",VLOOKUP($G127,$H$170:$N$177,7,TRUE))","v":""},"",null,"","",null,null,"coût du MWh utile",null,"dépenses totales"]
[null,null,null,0,null,20,0,"","","","","",null,"","",null,null,"bois","référence","bois","référence"]
[null,null,null,0,null,20,0,"","","","","",null,"","",null,"P1 - énergie bois",{"$f":"IF($F$102=0,0,T129/$F$102)","v":0},{"$f":"IF($J$64=0,0,U129/$J$64)","v":0},{"$f":"AB71","v":0}]
[null,null,null,0,null,20,0,"","","","","",null,"","",null,{"$f":"\"P1 - énergie appoint/ref\" &IF(F114=\"Oui\",\"dont P1 géothermie\",\"\")","v":"P1 - énergie appoint/ref"},{"$f":"IF($F$102=0,0,T130/$F$102)","v":0},{"$f":"IF($J$64=0,0,U130/$J$64)","v":0},{"$f":"AB72","v":0},{"$f":"T63","v":0}]
[null,null,null,0,null,20,0,"","","","","",null,"","",null,{"$f":"\"P2 - maintenance\"&IF(C114=\"Oui\",\"+ P2 ST\",\"\")&IF(F114=\"Oui\",\"+ P2 GEO\",\"\")","v":"P2 - maintenance"},{"$f":"IF($F$102=0,0,T131/$F$102)","v":0},{"$f":"IF($J$64=0,0,U131/$J$64)","v":0},{"$f":"AB73","v":0},{"$f":"U63","v":0}]
[null,null,null,0,null,20,0,"","","","","",null,"","",null,{"$f":"\"P3 - gros entretien\"&IF(C114=\"Oui\",\"+ P3 ST\",\"\")&IF(F114=\"Oui\",\"+ P3 GEO\",\"\")","v":"P3 - gros entretien"},{"$f":"IF($F$102=0,0,T132/$F$102)","v":0},{"$f":"IF($J$64=0,0,U132/$J$64)","v":0},{"$f":"AB78","v":0},{"$f":"V63","v":0}]
[null,null,null,0,null,20,0,"","","","","",null,"","",null,{"$f":"\"P4 - amortissements\"&IF(C114=\"Oui\",\"+ P4 ST\",\"\")&IF(F114=\"Oui\",\"+ P4 GEO\",\"\")","v":"P4 - amortissements"},{"$f":"IF($F$102=0,0,T133/$F$102)","v":0},{"$f":"IF($J$64=0,0,U133/$J$64)","v":0},{"$f":"AB81","v":{"$error":"#NUM!"}},{"$f":"W63","v":0}]
[null,null,null,0,null,20,0,"","","","","",null,"","",null,"TOTAL",{"$f":"SUM(R129:R133)","v":0},{"$f":"SUM(S129:S133)","v":0},{"$f":"SUM(T129:T133)","v":{"$error":"#NUM!"}},{"$f":"SUM(U129:U133)","v":0}]
[null,null,null,0,null,20,0,"","","","","",null,"","",null,{"$f":"IF(W7=\"oui\",IF(W8=\"oui\",\"\",\"TVA (si vente chaleur)\"),\"\")","v":""},{"$f":"IF(W7=\"oui\",IF(W8=\"oui\",\"\",0.055*R214),\"\")","v":""},{"$f":"IF(W7=\"oui\",IF(W8=\"oui\",\"\",0.2*S214),\"\")","v":""}]
[null,null,null,0,null,20,0,"","","","","",null,"","",null,{"$f":"IF(W7=\"oui\",IF(W8=\"oui\",\"\",\"TOTAL TTC\"),\"\")","v":""},{"$f":"IF(W7=\"oui\",IF(W8=\"oui\",\"\",R214+R215),\"\")","v":""},{"$f":"IF(W7=\"oui\",IF(W8=\"oui\",\"\",S214+S215),\"\")","v":""}]
[null,null,null,0,null,20,0,"","","","","",null,"",""]
[null,null,null,0,null,20,0,"","","","","",null,"","",null,"1ère approche de Tarification de la chaleur (si vente)"]
[null,null,null,0,null,20,0,"","","","","",null,"",""]
[null,null,null,0,null,20,0,"","","","","",null,"","",null,"MWh livrés",null,null,{"$f":"F102","v":0}]
[null,null,null,0,null,20,0,"","","","","",null,"","",null,"Puissance totale raccordées",null,null,{"$f":"C98","v":0}]
[null,null,null,0,null,20,0,"","","","","",null,"","",null,"coût unitaire R1 par MWh utile",null,null,{"$f":"IF(OR(T140=0,AB70=0),0,AB70/T140)","v":0}]
[null,null,null,0,null,20,0,"","","","","",null,"","",null,"coût unitaire R2 par kW",null,null,{"$f":"IF(OR(T141=0,T140=0),0,(AB73+AB78+AB81)/T141)","v":0}]
[null,null,null,0,null,20,0,"","","","","",null,"",""]
[null,null,null,0,null,20,0,"","","","","",null,"",""]
[null,null,null,0,null,20,0,"","","","","",null,"","",null,"PREMIERE APPROCHE DU COUT DU MWH PAR ABONNES (si vente de chaleur)"]
[null,null,null,0,null,20,0,"","","","","",null,"","",null,null,"scénario bois",null,null,null,null,null,null,"scénario référence",null,null,null,null,null,null,null,null,"delta TTC"]
[null,null,null,0,null,20,0,"","","","","",null,"","",null,null,"R1 bois","R2 bois","R1+R2","TVA (si vente de chaleur)","R1 + R2 TTC","€/MWh HT","€/MWh TTC","P1 référence","P2 référence","P3 référence","P4 référence","cout annuel HT","TVA","cout annuel TTC","€/Mwh HT","€/Mwh TTC"]
[null,null,null,0,null,20,0,"","","","","",null,"","",null,{"$f":"IF(D9=0,\"\",D9)","v":" "},{"$f":"$T$142*E70","v":0},{"$f":"$T$143*D70","v":0},{"$f":"R149+S149","v":0},{"$f":"IF($W$7=\"oui\",T149*(5.5%),T149*(20%))","v":0},{"$f":"T149+U149","v":0},{"$f":"IF(E70=0,0,T149/(E70))","v":0},{"$f":"IF(E70=0,0,V149/(E70))","v":0},{"$f":"IF(OR(F39=\"\",G39=\"\"),0,G39*(1+_xlfn.IFS(OR(D39=\"PAC\",D39=\"électricité\"),$Y$91,OR(D39=\"granulé\",D39=\"bois déchiqueté\"),$Y$90,OR(D39=\"fioul\",D39=\"gaz naturel\",D39=\"propane\"),$Y$92))*VLOOKUP(D39,$Y$7:$Z$12,2))","v":0},{"$f":"IF(F39=\"\",0,IF(AND(F39>1,F39<8.99),250,IF(AND(F39>9,F39<96),0.18*F39^2-7.6*F39+300,IF(AND(F39>95,F39<951),6.6*F39+530,IF(AND(F39>950,F39<3501),F39+5800,IF(F39>3500,3.2*F39-1900,\"\"))))))*1.3","v":0},{"$f":"0.01*IF(F39=0,0,IF($C39=\"\",\"définir le type de travaux envisagé pour ce batiment\",IF($F39=0,0,O9*IF(AND($F39>9,$F39<151),0.57*$F39^2+76*$F39+2500,IF(AND($F39>150,$F39<951),56.1*$F39+18300,IF(AND($F39>950,$F39<14501),34.3*$F39+39000,IF($F39>14500,20.3*$F39+242000,\"\")))))))*1.3","v":0},{"$f":"IF(X38=\"\",-PMT($AA$83,$Z$83,IF(F39=0,0,IF($C39=\"\",\"définir le type de travaux envisagé pour ce batiment\",IF($F39=0,0,O9*IF(AND($F39>9,$F39<151),0.57*$F39^2+76*$F39+2500,IF(AND($F39>150,$F39<951),56.1*$F39+18300,IF(AND($F39>950,$F39<14501),34.3*$F39+39000,IF($F39>14500,20.3*$F39+242000,\"\")))))))*1.3),-PMT($AA$83,X38,IF(F39=0,0,IF($C39=\"\",\"définir le type de travaux envisagé pour ce batiment\",IF($F39=0,0,O9*IF(AND($F39>9,$F39<151),0.57*$F39^2+76*$F39+2500,IF(AND($F39>150,$F39<951),56.1*$F39+18300,IF(AND($F39>950,$F39<14501),34.3*$F39+39000,IF($F39>14500,20.3*$F39+242000,\"\")))))))*1.3))","v":{"$error":"#NUM!"}},{"$f":"SUM(Y149:AB149)","v":{"$error":"#NUM!"}},{"$f":"AC149*W9","v":{"$error":"#NUM!"}},{"$f":"AD149+AC149","v":{"$error":"#NUM!"}},{"$f":"IF(J39=0,0,AC149/(J39))","v":{"$error":"#NUM!"}},{"$f":"IF(J39=0,0,AE149/(J39))","v":{"$error":"#NUM!"}},{"$f":"IF(AE149=0,0,(V149-AE149)/AE149)","v":{"$error":"#NUM!"}}]
[null,null,null,0,null,20,0,"","","","","",null,"","",null," ",{"$f":"$T$142*E71","v":0},{"$f":"$T$143*D71","v":0},{"$f":"R150+S150","v":0},{"$f":"IF($W$7=\"oui\",T150*(5.5%),T150*(20%))","v":0},{"$f":"T150+U150","v":0},{"$f":"IF(E71=0,0,T150/(E71))","v":0},{"$f":"IF(E71=0,0,V150/(E71))","v":0},{"$f":"IF(OR(F40=\"\",G40=\"\"),0,G40*(1+_xlfn.IFS(OR(D40=\"PAC\",D40=\"électricité\"),$Y$91,OR(D40=\"granulé\",D40=\"bois déchiqueté\"),$Y$90,OR(D40=\"fioul\",D40=\"gaz naturel\",D40=\"propane\"),$Y$92))*VLOOKUP(D40,$Y$7:$Z$12,2))","v":0},{"$f":"IF(F40=\"\",0,IF(AND(F40>1,F40<8.99),250,IF(AND(F40>9,F40<96),0.18*F40^2-7.6*F40+300,IF(AND(F40>95,F40<951),6.6*F40+530,IF(AND(F40>950,F40<3501),F40+5800,IF(F40>3500,3.2*F40-1900,\"\"))))))*1.3","v":0},0,{"$error":"#NUM!"},{"$f":"SUM(Y150:AB150)","v":{"$error":"#NUM!"}},{"$error":"#NUM!"},{"$f":"AD150+AC150","v":{"$error":"#NUM!"}},{"$error":"#NUM!"},{"$error":"#NUM!"},{"$f":"IF(AE150=0,0,(V150-AE150)/AE150)","v":{"$error":"#NUM!"}}]
[null,null,null,0,null,20,{"$f":"(E151/(1.163*F151))","v":0},"","","","","",null,"","",null," ",0,0,0,0,0,0,0,{"$f":"IF(OR(F41=\"\",G41=\"\"),0,G41*(1+_xlfn.IFS(OR(D41=\"PAC\",D41=\"électricité\"),$Y$91,OR(D41=\"granulé\",D41=\"bois déchiqueté\"),$Y$90,OR(D41=\"fioul\",D41=\"gaz naturel\",D41=\"propane\"),$Y$92))*VLOOKUP(D41,$Y$7:$Z$12,2))","v":0},0,0,{"$error":"#NUM!"},{"$error":"#NUM!"},{"$error":"#NUM!"},{"$error":"#NUM!"},{"$error":"#NUM!"},{"$error":"#NUM!"},{"$error":"#NUM!"}]
[null,null,null,0,null,20,0,"","","","","",null,"","",null," ",0,0,0,0,0,0,0,{"$f":"IF(OR(F42=\"\",G42=\"\"),0,G42*(1+_xlfn.IFS(OR(D42=\"PAC\",D42=\"électricité\"),$Y$91,OR(D42=\"granulé\",D42=\"bois déchiqueté\"),$Y$90,OR(D42=\"fioul\",D42=\"gaz naturel\",D42=\"propane\"),$Y$92))*VLOOKUP(D42,$Y$7:$Z$12,2))","v":0},0,0,{"$error":"#NUM!"},{"$error":"#NUM!"},{"$error":"#NUM!"},{"$error":"#NUM!"},{"$error":"#NUM!"},{"$error":"#NUM!"},{"$error":"#NUM!"}]
[null,null,null,0,null,20,0,"","","","","",null,"","",null," ",0,0,0,0,0,0,0,{"$f":"IF(OR(F43=\"\",G43=\"\"),0,G43*(1+_xlfn.IFS(OR(D43=\"PAC\",D43=\"électricité\"),$Y$91,OR(D43=\"granulé\",D43=\"bois déchiqueté\"),$Y$90,OR(D43=\"fioul\",D43=\"gaz naturel\",D43=\"propane\"),$Y$92))*VLOOKUP(D43,$Y$7:$Z$12,2))","v":0},0,0,{"$error":"#NUM!"},{"$error":"#NUM!"},{"$error":"#NUM!"},{"$error":"#NUM!"},{"$error":"#NUM!"},{"$error":"#NUM!"},{"$error":"#NUM!"}]
[null,null,null,0,null,20,0,"","","","","",null,"","",null," ",0,0,0,0,0,0,0,{"$f":"IF(OR(F44=\"\",G44=\"\"),0,G44*(1+_xlfn.IFS(OR(D44=\"PAC\",D44=\"électricité\"),$Y$91,OR(D44=\"granulé\",D44=\"bois déchiqueté\"),$Y$90,OR(D44=\"fioul\",D44=\"gaz naturel\",D44=\"propane\"),$Y$92))*VLOOKUP(D44,$Y$7:$Z$12,2))","v":0},0,0,{"$error":"#NUM!"},{"$error":"#NUM!"},{"$error":"#NUM!"},{"$error":"#NUM!"},{"$error":"#NUM!"},{"$error":"#NUM!"},{"$error":"#NUM!"}]
[null,null,null,0,null,20,0,"","","","","",null,"","",null," ",0,0,0,0,0,0,0,{"$f":"IF(OR(F45=\"\",G45=\"\"),0,G45*(1+_xlfn.IFS(OR(D45=\"PAC\",D45=\"électricité\"),$Y$91,OR(D45=\"granulé\",D45=\"bois déchiqueté\"),$Y$90,OR(D45=\"fioul\",D45=\"gaz naturel\",D45=\"propane\"),$Y$92))*VLOOKUP(D45,$Y$7:$Z$12,2))","v":0},0,0,{"$error":"#NUM!"},{"$error":"#NUM!"},{"$error":"#NUM!"},{"$error":"#NUM!"},{"$error":"#NUM!"},{"$error":"#NUM!"},{"$error":"#NUM!"}]
[null,null,null,0,null,20,0,"","","","","",null,"","",null," ",0,0,0,0,0,0,0,{"$f":"IF(OR(F46=\"\",G46=\"\"),0,G46*(1+_xlfn.IFS(OR(D46=\"PAC\",D46=\"électricité\"),$Y$91,OR(D46=\"granulé\",D46=\"bois déchiqueté\"),$Y$90,OR(D46=\"fioul\",D46=\"gaz naturel\",D46=\"propane\"),$Y$92))*VLOOKUP(D46,$Y$7:$Z$12,2))","v":0},0,0,{"$error":"#NUM!"},{"$error":"#NUM!"},{"$error":"#NUM!"},{"$error":"#NUM!"},{"$error":"#NUM!"},{"$error":"#NUM!"},{"$error":"#NUM!"}]
[null,null,null,0,null,20,0,"","","","","",null,"","",null," ",0,0,0,0,0,0,0,{"$f":"IF(OR(F47=\"\",G47=\"\"),0,G47*(1+_xlfn.IFS(OR(D47=\"PAC\",D47=\"électricité\"),$Y$91,OR(D47=\"granulé\",D47=\"bois déchiqueté\"),$Y$90,OR(D47=\"fioul\",D47=\"gaz naturel\",D47=\"propane\"),$Y$92))*VLOOKUP(D47,$Y$7:$Z$12,2))","v":0},0,0,{"$error":"#NUM!"},{"$error":"#NUM!"},{"$error":"#NUM!"},{"$error":"#NUM!"},{"$error":"#NUM!"},{"$error":"#NUM!"},{"$error":"#NUM!"}]
[null,null,null,0,null,20,0,"","","","","",null,"","",null," ",0,0,0,0,0,0,0,{"$f":"IF(OR(F48=\"\",G48=\"\"),0,G48*(1+_xlfn.IFS(OR(D48=\"PAC\",D48=\"électricité\"),$Y$91,OR(D48=\"granulé\",D48=\"bois déchiqueté\"),$Y$90,OR(D48=\"fioul\",D48=\"gaz naturel\",D48=\"propane\"),$Y$92))*VLOOKUP(D48,$Y$7:$Z$12,2))","v":0},0,0,{"$error":"#NUM!"},{"$error":"#NUM!"},{"$error":"#NUM!"},{"$error":"#NUM!"},{"$error":"#NUM!"},{"$error":"#NUM!"},{"$error":"#NUM!"}]
[null,null,null,0,null,20,0,"","","","","",null,"","",null," ",0,0,0,0,0,0,0,{"$f":"IF(OR(F49=\"\",G49=\"\"),0,G49*(1+_xlfn.IFS(OR(D49=\"PAC\",D49=\"électricité\"),$Y$91,OR(D49=\"granulé\",D49=\"bois déchiqueté\"),$Y$90,OR(D49=\"fioul\",D49=\"gaz naturel\",D49=\"propane\"),$Y$92))*VLOOKUP(D49,$Y$7:$Z$12,2))","v":0},0,0,{"$error":"#NUM!"},{"$error":"#NUM!"},{"$error":"#NUM!"},{"$error":"#NUM!"},{"$error":"#NUM!"},{"$error":"#NUM!"},{"$error":"#NUM!"}]
[null,null,null,0,null,20,0,"","","","","",null,"","",null," ",0,0,0,0,0,0,0,{"$f":"IF(OR(F50=\"\",G50=\"\"),0,G50*(1+_xlfn.IFS(OR(D50=\"PAC\",D50=\"électricité\"),$Y$91,OR(D50=\"granulé\",D50=\"bois déchiqueté\"),$Y$90,OR(D50=\"fioul\",D50=\"gaz naturel\",D50=\"propane\"),$Y$92))*VLOOKUP(D50,$Y$7:$Z$12,2))","v":0},0,0,{"$error":"#NUM!"},{"$error":"#NUM!"},{"$error":"#NUM!"},{"$error":"#NUM!"},{"$error":"#NUM!"},{"$error":"#NUM!"},{"$error":"#NUM!"}]
[null,null,null,0,null,20,0,"","","","","",null,"","",null," ",0,0,0,0,0,0,0,{"$f":"IF(OR(F51=\"\",G51=\"\"),0,G51*(1+_xlfn.IFS(OR(D51=\"PAC\",D51=\"électricité\"),$Y$91,OR(D51=\"granulé\",D51=\"bois déchiqueté\"),$Y$90,OR(D51=\"fioul\",D51=\"gaz naturel\",D51=\"propane\"),$Y$92))*VLOOKUP(D51,$Y$7:$Z$12,2))","v":0},0,0,{"$error":"#NUM!"},{"$error":"#NUM!"},{"$error":"#NUM!"},{"$error":"#NUM!"},{"$error":"#NUM!"},{"$error":"#NUM!"},{"$error":"#NUM!"}]
[null,null,null,0,null,20,0,"","","","","",null,"","",null," ",0,0,0,0,0,0,0,{"$f":"IF(OR(F52=\"\",G52=\"\"),0,G52*(1+_xlfn.IFS(OR(D52=\"PAC\",D52=\"électricité\"),$Y$91,OR(D52=\"granulé\",D52=\"bois déchiqueté\"),$Y$90,OR(D52=\"fioul\",D52=\"gaz naturel\",D52=\"propane\"),$Y$92))*VLOOKUP(D52,$Y$7:$Z$12,2))","v":0},0,0,{"$error":"#NUM!"},{"$error":"#NUM!"},{"$error":"#NUM!"},{"$error":"#NUM!"},{"$error":"#NUM!"},{"$error":"#NUM!"},{"$error":"#NUM!"}]
[null,null,null,0,null,20,0,"","","","","",null,"","",null," ",0,0,0,0,0,0,0,{"$f":"IF(OR(F53=\"\",G53=\"\"),0,G53*(1+_xlfn.IFS(OR(D53=\"PAC\",D53=\"électricité\"),$Y$91,OR(D53=\"granulé\",D53=\"bois déchiqueté\"),$Y$90,OR(D53=\"fioul\",D53=\"gaz naturel\",D53=\"propane\"),$Y$92))*VLOOKUP(D53,$Y$7:$Z$12,2))","v":0},0,0,{"$error":"#NUM!"},{"$error":"#NUM!"},{"$error":"#NUM!"},{"$error":"#NUM!"},{"$error":"#NUM!"},{"$error":"#NUM!"},{"$error":"#NUM!"}]
[null,null,null,0,null,20,0,"","","","","",null,"","",null," ",0,0,0,0,0,0,0,{"$f":"IF(OR(F54=\"\",G54=\"\"),0,G54*(1+_xlfn.IFS(OR(D54=\"PAC\",D54=\"électricité\"),$Y$91,OR(D54=\"granulé\",D54=\"bois déchiqueté\"),$Y$90,OR(D54=\"fioul\",D54=\"gaz naturel\",D54=\"propane\"),$Y$92))*VLOOKUP(D54,$Y$7:$Z$12,2))","v":0},0,0,{"$error":"#NUM!"},{"$error":"#NUM!"},{"$error":"#NUM!"},{"$error":"#NUM!"},{"$error":"#NUM!"},{"$error":"#NUM!"},{"$error":"#NUM!"}]
[null,null,null,0,null,20,0,"","","","","",null,"","",null," ",0,0,0,0,0,0,0,{"$f":"IF(OR(F55=\"\",G55=\"\"),0,G55*(1+_xlfn.IFS(OR(D55=\"PAC\",D55=\"électricité\"),$Y$91,OR(D55=\"granulé\",D55=\"bois déchiqueté\"),$Y$90,OR(D55=\"fioul\",D55=\"gaz naturel\",D55=\"propane\"),$Y$92))*VLOOKUP(D55,$Y$7:$Z$12,2))","v":0},0,0,{"$error":"#NUM!"},{"$error":"#NUM!"},{"$error":"#NUM!"},{"$error":"#NUM!"},{"$error":"#NUM!"},{"$error":"#NUM!"},{"$error":"#NUM!"}]
[null,"Total",{"$f":"SUM(C126:C165)","v":0},"densité thermique du réseau :",null,{"$f":"IF(C166=0,\"\",$F$102/C166)","v":""},null,null,null,null,null,{"$f":"SUM(L126:L165)","v":0},null,{"$f":"SUM(N126:N165)","v":0},{"$f":"SUM(O126:O165)","v":0},null," ",0,0,0,0,0,0,0,{"$f":"IF(OR(F56=\"\",G56=\"\"),0,G56*(1+_xlfn.IFS(OR(D56=\"PAC\",D56=\"électricité\"),$Y$91,OR(D56=\"granulé\",D56=\"bois déchiqueté\"),$Y$90,OR(D56=\"fioul\",D56=\"gaz naturel\",D56=\"propane\"),$Y$92))*VLOOKUP(D56,$Y$7:$Z$12,2))","v":0},0,0,{"$error":"#NUM!"},{"$error":"#NUM!"},{"$error":"#NUM!"},{"$error":"#NUM!"},{"$error":"#NUM!"},{"$error":"#NUM!"},{"$error":"#NUM!"}]
[null,null,null,null,null,null,null,null,null,null,null,null,null,null,null,null," ",0,0,0,0,0,0,0,{"$f":"IF(OR(F57=\"\",G57=\"\"),0,G57*(1+_xlfn.IFS(OR(D57=\"PAC\",D57=\"électricité\"),$Y$91,OR(D57=\"granulé\",D57=\"bois déchiqueté\"),$Y$90,OR(D57=\"fioul\",D57=\"gaz naturel\",D57=\"propane\"),$Y$92))*VLOOKUP(D57,$Y$7:$Z$12,2))","v":0},0,0,{"$error":"#NUM!"},{"$error":"#NUM!"},{"$error":"#NUM!"},{"$error":"#NUM!"},{"$error":"#NUM!"},{"$error":"#NUM!"},{"$error":"#NUM!"}]
[null,"DN","Longueur de tranchée (ml)","Total métrés par tranche","ratio investissement","investissement",null,"Source INPAL",null,null,null,null,null,null,null,null," ",0,0,0,0,0,0,0,{"$f":"IF(OR(F58=\"\",G58=\"\"),0,G58*(1+_xlfn.IFS(OR(D58=\"PAC\",D58=\"électricité\"),$Y$91,OR(D58=\"granulé\",D58=\"bois déchiqueté\"),$Y$90,OR(D58=\"fioul\",D58=\"gaz naturel\",D58=\"propane\"),$Y$92))*VLOOKUP(D58,$Y$7:$Z$12,2))","v":0},0,0,{"$error":"#NUM!"},{"$error":"#NUM!"},{"$error":"#NUM!"},{"$error":"#NUM!"},{"$error":"#NUM!"},{"$error":"#NUM!"},{"$error":"#NUM!"}]
[null,"DN650",{"$f":"SUMPRODUCT(($H$126:$H$165=$B169)*($C$126:$C$165))","v":0},{"$f":"SUM(C169:C173)","v":0},1800,{"$f":"E169*C169","v":0},null,"débit mini (m3/h)","débit maxi m3/h","DN","Pertes W/ml\nIso standart\n(source INPAL)","Pertes W/ml - iso +\n(source INPAL)",null,"Pertes W/ml- iso ++\n(source INPAL)",null,null," ",0,0,0,0,0,0,0,{"$f":"IF(OR(F59=\"\",G59=\"\"),0,G59*(1+_xlfn.IFS(OR(D59=\"PAC\",D59=\"électricité\"),$Y$91,OR(D59=\"granulé\",D59=\"bois déchiqueté\"),$Y$90,OR(D59=\"fioul\",D59=\"gaz naturel\",D59=\"propane\"),$Y$92))*VLOOKUP(D59,$Y$7:$Z$12,2))","v":0},0,0,{"$error":"#NUM!"},{"$error":"#NUM!"},{"$error":"#NUM!"},{"$error":"#NUM!"},{"$error":"#NUM!"},{"$error":"#NUM!"},{"$error":"#NUM!"}]
[null,"DN600",0,null,1700,0,null,0.1,5,"DN40",33,33,null,33,null,null," ",0,0,0,0,0,0,0,{"$f":"IF(OR(F60=\"\",G60=\"\"),0,G60*(1+_xlfn.IFS(OR(D60=\"PAC\",D60=\"électricité\"),$Y$91,OR(D60=\"granulé\",D60=\"bois déchiqueté\"),$Y$90,OR(D60=\"fioul\",D60=\"gaz naturel\",D60=\"propane\"),$Y$92))*VLOOKUP(D60,$Y$7:$Z$12,2))","v":0},0,0,{"$error":"#NUM!"},{"$error":"#NUM!"},{"$error":"#NUM!"},{"$error":"#NUM!"},{"$error":"#NUM!"},{"$error":"#NUM!"},{"$error":"#NUM!"}]
[null,"DN550",0,null,1600,0,null,6,10,"DN65",34.17,28.65,null,25.1,null,null," ",0,0,0,0,0,0,0,{"$f":"IF(OR(F61=\"\",G61=\"\"),0,G61*(1+_xlfn.IFS(OR(D61=\"PAC\",D61=\"électricité\"),$Y$91,OR(D61=\"granulé\",D61=\"bois déchiqueté\"),$Y$90,OR(D61=\"fioul\",D61=\"gaz naturel\",D61=\"propane\"),$Y$92))*VLOOKUP(D61,$Y$7:$Z$12,2))","v":0},0,0,{"$error":"#NUM!"},{"$error":"#NUM!"},{"$error":"#NUM!"},{"$error":"#NUM!"},{"$error":"#NUM!"},{"$error":"#NUM!"},{"$error":"#NUM!"}]
[null,"DN500",0,null,1500,0,null,11,15,"DN80",35.22,30,null,26.57,null,null," ",0,0,0,0,0,0,0,{"$f":"IF(OR(F62=\"\",G62=\"\"),0,G62*(1+_xlfn.IFS(OR(D62=\"PAC\",D62=\"électricité\"),$Y$91,OR(D62=\"granulé\",D62=\"bois déchiqueté\"),$Y$90,OR(D62=\"fioul\",D62=\"gaz naturel\",D62=\"propane\"),$Y$92))*VLOOKUP(D62,$Y$7:$Z$12,2))","v":0},0,0,{"$error":"#NUM!"},{"$error":"#NUM!"},{"$error":"#NUM!"},{"$error":"#NUM!"},{"$error":"#NUM!"},{"$error":"#NUM!"},{"$error":"#NUM!"}]
[null,"DN450",0,null,1400,0,null,16,20,"DN100",36.86,31.31,null,27.56,null,null," ",0,0,0,0,0,0,0,{"$f":"IF(OR(F63=\"\",G63=\"\"),0,G63*(1+_xlfn.IFS(OR(D63=\"PAC\",D63=\"électricité\"),$Y$91,OR(D63=\"granulé\",D63=\"bois déchiqueté\"),$Y$90,OR(D63=\"fioul\",D63=\"gaz naturel\",D63=\"propane\"),$Y$92))*VLOOKUP(D63,$Y$7:$Z$12,2))","v":0},0,0,{"$error":"#NUM!"},{"$error":"#NUM!"},{"$error":"#NUM!"},{"$error":"#NUM!"},{"$error":"#NUM!"},{"$error":"#NUM!"},{"$error":"#NUM!"}]
[null,"DN400",0,{"$f":"SUM(C174:C176)","v":0},1300,0,null,21,50,"DN125",42.49,35.85,null,30.9,null,null,"TOTAL",{"$f":"SUM(R149:R173)","v":0},{"$f":"SUM(S149:S173)","v":0},{"$f":"SUM(T149:T173)","v":0},{"$f":"SUM(U149:U173)","v":0},{"$f":"SUM(V149:V173)","v":0},null,null,{"$f":"SUM(Y149:Y173)","v":0},0,0,{"$error":"#NUM!"},{"$error":"#NUM!"},{"$error":"#NUM!"},{"$error":"#NUM!"}]
[null,"DN350",0,null,1200,0,null,51,80,"DN150",49.57,40.58,null,33.86]
[null,"DN300",0,null,1100,0,null,81,150,"DN200",54.3,43.02,null,35.61]
[null,"DN250",0,{"$f":"SUM(C177:C179)","v":0},1000,0,null,151,400,"DN250",52.98,42.49,null,35.979999999999997]
[null,"DN200",0,null,900,{"$f":"C178*E178","v":0},null,null,null,null,null,null,null,null,null,null,"15/ Evolution des dépenses annuelles"]
[null,"DN150",0,null,800,0,null,null,null,null,null,null,null,null,null,null,null,"dépenses annuelles globales - projet bois",null,null,null,null,null,"dépenses annuelles globales - solution de référence",null,null,null,null,"delta","économies de fonctionnement",null,"dépenses globales cumulées",null,"dépenses de fonctionnement avec inv de départ"]
[null,"DN125",0,{"$f":"SUM(C180:C182)","v":0},700,0,null,null,null,null,null,null,null,null,null,null,null,"P1 bois","P1 appoint","P2+P3","fonctionnement bois","P4","total bois","P1","P2+P3","fonctionnement référence","P4","total référence",null,"par an","économies cumulées","Total cumulé bois","Total cumulé référence","Dépense cumulée bois (inv départ)","Dépense cumulée fossile (inv départ)"]
[null,"DN100",0,null,600,0,null,null,null,null,null,null,null,null,null,null,{"$f":"R8","v":" "},{"$f":"T129","v":0},{"$f":"T130","v":0},{"$f":"T131+T132","v":0},{"$f":"R181+S181+T181","v":0},{"$f":"IF(($Q$181+$Z$82)-Q181>0,$AB$82,0)+IF(($Q$181+$Z$83)-Q181>0,$AB$83,0)","v":{"$error":"#VALUE!"}},{"$f":"R181+T181+S181+V181","v":{"$error":"#VALUE!"}},{"$f":"U130","v":0},{"$f":"U131+U132","v":0},{"$f":"X181+Y181","v":0},{"$f":"IF(MAX($X$38:$X$62)-(Q181-$R$8)>0,$W$63,0)","v":{"$error":"#VALUE!"}},{"$f":"X181+Y181+AA181","v":{"$error":"#VALUE!"}},{"$f":"AB181-W181","v":{"$error":"#VALUE!"}},{"$f":"X181+Y181-R181-S181-T181","v":0},{"$f":"AD181","v":0},{"$f":"W181","v":{"$error":"#VALUE!"}},{"$f":"AB181","v":{"$error":"#VALUE!"}},{"$f":"$U$95+U181","v":0},{"$f":"$R$63+Z181","v":0}]
[null,"DN80",0,null,500,0,null,null,null,null,null,null,null,null,null,null,{"$f":"Q181+1","v":{"$error":"#VALUE!"}},{"$f":"R181*(1+Y$90)","v":0},{"$f":"S181*(1+Y$92)","v":0},{"$f":"IFERROR(T181*(1+($AB$75+$AB$76)/$AB$73*$Y$89+$AB$74/$AB$73*$Y$91),0)","v":0},{"$f":"R182+S182+T182","v":0},{"$error":"#VALUE!"},{"$f":"R182+T182+S182+V182","v":{"$error":"#VALUE!"}},{"$f":"X181*(1+Y$92)","v":0},{"$f":"Y181*(1+Y$89)","v":0},{"$f":"X182+Y182","v":0},{"$error":"#VALUE!"},{"$f":"X182+Y182+AA182","v":{"$error":"#VALUE!"}},{"$error":"#VALUE!"},0,{"$f":"AD182+AE181","v":0},{"$f":"AF181+W182","v":{"$error":"#VALUE!"}},{"$f":"AG181+AB182","v":{"$error":"#VALUE!"}},0,0]
[null,"DN65",0,{"$f":"SUM(C183:C189)","v":0},350,0,null,null,null,null,null,null,null,null,null,null,{"$f":"Q182+1","v":{"$error":"#VALUE!"}},0,0,{"$f":"IFERROR(T182*(1+($AB$75+$AB$76)/$AB$73*$Y$89+$AB$74/$AB$73*$Y$91),0)","v":0},{"$f":"R183+S183+T183","v":0},{"$error":"#VALUE!"},{"$f":"R183+T183+S183+V183","v":{"$error":"#VALUE!"}},0,0,{"$f":"X183+Y183","v":0},{"$error":"#VALUE!"},{"$f":"X183+Y183+AA183","v":{"$error":"#VALUE!"}},{"$error":"#VALUE!"},0,{"$f":"AD183+AE182","v":0},{"$f":"AF182+W183","v":{"$error":"#VALUE!"}},{"$f":"AG182+AB183","v":{"$error":"#VALUE!"}},0,0]
[null,"DN50",0,null,300,0,null,null,null,null,null,null,null,null,null,null,{"$f":"Q183+1","v":{"$error":"#VALUE!"}},0,0,0,0,{"$error":"#VALUE!"},{"$error":"#VALUE!"},0,0,0,{"$error":"#VALUE!"},{"$error":"#VALUE!"},{"$error":"#VALUE!"},0,{"$f":"AD184+AE183","v":0},{"$f":"AF183+W184","v":{"$error":"#VALUE!"}},{"$f":"AG183+AB184","v":{"$error":"#VALUE!"}},0,0]
[null,"DN40",0,null,250,0,null,null,null,null,null,null,null,null,null,null,{"$error":"#VALUE!"},0,0,0,0,{"$error":"#VALUE!"},{"$error":"#VALUE!"},0,0,0,{"$error":"#VALUE!"},{"$error":"#VALUE!"},{"$error":"#VALUE!"},0,0,{"$error":"#VALUE!"},{"$error":"#VALUE!"},0,0]
[null,"DN32",0,null,250,0,null,null,null,null,null,null,null,null,null,null,{"$error":"#VALUE!"},0,0,0,0,{"$error":"#VALUE!"},{"$error":"#VALUE!"},0,0,0,{"$error":"#VALUE!"},{"$error":"#VALUE!"},{"$error":"#VALUE!"},0,0,{"$error":"#VALUE!"},{"$error":"#VALUE!"},0,0]
[null,"DN25",0,null,250,0,null,null,null,null,null,null,null,null,null,null,{"$error":"#VALUE!"},0,0,0,0,{"$error":"#VALUE!"},{"$error":"#VALUE!"},0,0,0,{"$error":"#VALUE!"},{"$error":"#VALUE!"},{"$error":"#VALUE!"},0,0,{"$error":"#VALUE!"},{"$error":"#VALUE!"},0,0]
[null,"DN20",0,null,250,0,null,null,null,null,null,null,null,null,null,null,{"$error":"#VALUE!"},0,0,0,0,{"$error":"#VALUE!"},{"$error":"#VALUE!"},0,0,0,{"$error":"#VALUE!"},{"$error":"#VALUE!"},{"$error":"#VALUE!"},0,0,{"$error":"#VALUE!"},{"$error":"#VALUE!"},0,0]
[null,"DN15",0,null,250,0,null,null,null,null,null,null,null,null,null,null,{"$f":"Q188+1","v":{"$error":"#VALUE!"}},0,0,0,0,{"$error":"#VALUE!"},{"$error":"#VALUE!"},0,0,0,{"$error":"#VALUE!"},{"$error":"#VALUE!"},{"$error":"#VALUE!"},0,{"$f":"AD189+AE188","v":0},{"$f":"AF188+W189","v":{"$error":"#VALUE!"}},{"$f":"AG188+AB189","v":{"$error":"#VALUE!"}},0,0]
[null,null,"Total",{"$f":"SUM(D169:D183)","v":0},null,{"$f":"SUM(F169:F189)","v":0},null,null,null,null,null,null,null,null,null,null,{"$f":"Q189+1","v":{"$error":"#VALUE!"}},0,0,0,0,{"$error":"#VALUE!"},{"$error":"#VALUE!"},0,0,0,{"$error":"#VALUE!"},{"$error":"#VALUE!"},{"$error":"#VALUE!"},0,{"$f":"AD190+AE189","v":0},{"$f":"AF189+W190","v":{"$error":"#VALUE!"}},{"$f":"AG189+AB190","v":{"$error":"#VALUE!"}},0,0]
[null,null,null,null,null,null,null,null,null,null,null,null,null,null,null,null,{"$f":"Q190+1","v":{"$error":"#VALUE!"}},0,0,0,0,{"$error":"#VALUE!"},{"$error":"#VALUE!"},0,0,0,{"$error":"#VALUE!"},{"$error":"#VALUE!"},{"$error":"#VALUE!"},0,{"$f":"AD191+AE190","v":0},{"$f":"AF190+W191","v":{"$error":"#VALUE!"}},{"$f":"AG190+AB191","v":{"$error":"#VALUE!"}},0,0]
[null,null,null,null,null,null,null,null,null,null,null,null,null,null,null,null,{"$f":"Q191+1","v":{"$error":"#VALUE!"}},0,0,0,0,{"$error":"#VALUE!"},{"$error":"#VALUE!"},0,0,0,{"$error":"#VALUE!"},{"$error":"#VALUE!"},{"$error":"#VALUE!"},0,{"$f":"AD192+AE191","v":0},{"$f":"AF191+W192","v":{"$error":"#VALUE!"}},{"$f":"AG191+AB192","v":{"$error":"#VALUE!"}},0,0]
[null,null,null,null,null,null,null,null,null,null,null,null,null,null,null,null,{"$error":"#VALUE!"},0,0,0,0,{"$error":"#VALUE!"},{"$error":"#VALUE!"},0,0,0,{"$error":"#VALUE!"},{"$error":"#VALUE!"},{"$error":"#VALUE!"},0,0,{"$error":"#VALUE!"},{"$error":"#VALUE!"},0,0]
[null,"Type de bâtiment","Catégorisation pour fiche CEE","Surface par type de bâtiment","Fiche CEE BAT TH 127 < 400 kW",null,null,"Type de bâtiment","Catégorisation pour fiche CEE","Surface par type de bâtiment","Fiche CEE BAT TH 127 > 400 kW",null,null,null,null,null,{"$error":"#VALUE!"},0,0,0,0,{"$error":"#VALUE!"},{"$error":"#VALUE!"},0,0,0,{"$error":"#VALUE!"},{"$error":"#VALUE!"},{"$error":"#VALUE!"},0,0,{"$error":"#VALUE!"},{"$error":"#VALUE!"},0,0]
[null,null,null,null,"Coefficient chauffage","Coefficient chauffage + ECS",null,null,null,null,"Coefficient chauffage","Coefficient chauffage + ECS",null,null,null,null,{"$error":"#VALUE!"},0,0,0,0,{"$error":"#VALUE!"},{"$error":"#VALUE!"},0,0,0,{"$error":"#VALUE!"},{"$error":"#VALUE!"},{"$error":"#VALUE!"},0,0,{"$error":"#VALUE!"},{"$error":"#VALUE!"},0,0]
[null,{"$f":"'données d''entrée'!Y3","v":"Logements collectifs /Résidences étudiantes"},null,{"$f":"IFERROR(SUMIFS($E$9:$E$33,$B$9:$B$33,B196,$D$70:$D$94,\"<400\"),0)","v":0},{"$f":"'données d''entrée'!AA3","v":0},{"$f":"'données d''entrée'!AB3","v":0},null,{"$f":"'données d''entrée'!AE3","v":"Logements collectifs /Résidences étudiantes"},null,{"$f":"IFERROR(SUMIFS($E$9:$E$33,$B$9:$B$33,H196,$D$70:$D$94,\">400\"),0)","v":0},{"$f":"'données d''entrée'!AG3","v":0},{"$f":"'données d''entrée'!AH3","v":0},null,null,null,null,{"$error":"#VALUE!"},0,0,0,0,{"$error":"#VALUE!"},{"$error":"#VALUE!"},0,0,0,{"$error":"#VALUE!"},{"$error":"#VALUE!"},{"$error":"#VALUE!"},0,0,{"$error":"#VALUE!"},{"$error":"#VALUE!"},0,0]
[null,{"$f":"'données d''entrée'!Y4","v":" EHPAD"},"Santé",{"$f":"IFERROR(SUMIFS($E$9:$E$33,$B$9:$B$33,B197,$D$70:$D$94,\"<400\"),0)","v":0},{"$f":"'données d''entrée'!AA4","v":400},{"$f":"'données d''entrée'!AB4","v":540},null,{"$f":"'données d''entrée'!AE4","v":" EHPAD"},"Santé",{"$f":"IFERROR(SUMIFS($E$9:$E$33,$B$9:$B$33,H197,$D$70:$D$94,\">400\"),0)","v":0},{"$f":"'données d''entrée'!AG4","v":310},{"$f":"'données d''entrée'!AH4","v":410},null,null,null,null,{"$error":"#VALUE!"},0,0,0,0,{"$error":"#VALUE!"},{"$error":"#VALUE!"},0,0,0,{"$error":"#VALUE!"},{"$error":"#VALUE!"},{"$error":"#VALUE!"},0,0,{"$error":"#VALUE!"},{"$error":"#VALUE!"},0,0]
[null,{"$f":"'données d''entrée'!Y5","v":"Maisons individuelles"},null,0,{"$f":"'données d''entrée'!AA5","v":0},{"$f":"'données d''entrée'!AB5","v":0},null,{"$f":"'données d''entrée'!AE5","v":"Maisons indivduelles"},null,0,{"$f":"'données d''entrée'!AG5","v":0},{"$f":"'données d''entrée'!AH5","v":0},null,null,null,null,{"$error":"#VALUE!"},0,0,0,0,{"$error":"#VALUE!"},{"$error":"#VALUE!"},0,0,0,{"$error":"#VALUE!"},{"$error":"#VALUE!"},{"$error":"#VALUE!"},0,0,{"$error":"#VALUE!"},{"$error":"#VALUE!"},0,0]
[null,{"$f":"'données d''entrée'!Y6","v":"Bureaux"},"Bureaux",0,{"$f":"'données d''entrée'!AA6","v":480},{"$f":"'données d''entrée'!AB6","v":510},null,{"$f":"'données d''entrée'!AE6","v":"Bureaux"},"Bureaux",0,{"$f":"'données d''entrée'!AG6","v":370},{"$f":"'données d''entrée'!AH6","v":390},null,null,null,null,{"$error":"#VALUE!"},0,0,0,0,{"$error":"#VALUE!"},{"$error":"#VALUE!"},0,0,0,{"$error":"#VALUE!"},{"$error":"#VALUE!"},{"$error":"#VALUE!"},0,0,{"$error":"#VALUE!"},{"$error":"#VALUE!"},0,0]
[null,{"$f":"'données d''entrée'!Y7","v":" Lycées avec internat"},"Enseignement",0,{"$f":"'données d''entrée'!AA7","v":310},{"$f":"'données d''entrée'!AB7","v":360},null,{"$f":"'données d''entrée'!AE7","v":" Lycées avec internat"},"Enseignement",0,{"$f":"'données d''entrée'!AG7","v":240},{"$f":"'données d''entrée'!AH7","v":270},null,null,null,null,{"$error":"#VALUE!"},0,0,0,0,{"$error":"#VALUE!"},{"$error":"#VALUE!"},0,0,0,{"$error":"#VALUE!"},{"$error":"#VALUE!"},{"$error":"#VALUE!"},0,0,{"$error":"#VALUE!"},{"$error":"#VALUE!"},0,0]
[null,{"$f":"'données d''entrée'!Y8","v":"Crèches/ Écoles/ Collèges/ Lycée sans internat"},"Enseignement",0,{"$f":"'données d''entrée'!AA8","v":310},{"$f":"'données d''entrée'!AB8","v":360},null,{"$f":"'données d''entrée'!AE8","v":"Crèches/ Écoles/ Collèges/ Lycée sans internat"},"Enseignement",0,{"$f":"'données d''entrée'!AG8","v":240},{"$f":"'données d''entrée'!AH8","v":270},null,null,null,null,{"$error":"#VALUE!"},{"$f":"SUM(R181:R200)","v":0},0,0,0,{"$error":"#VALUE!"},{"$error":"#VALUE!"},0,0,0,{"$error":"#VALUE!"},{"$error":"#VALUE!"},{"$error":"#VALUE!"},0,0,{"$error":"#VALUE!"},{"$error":"#VALUE!"},0,0]
[null,{"$f":"'données d''entrée'!Y9","v":"Café / hôtels / restaurants"},"Hôtellerie/restauration",0,{"$f":"'données d''entrée'!AA4","v":400},{"$f":"'données d''entrée'!AB4","v":540},null,{"$f":"'données d''entrée'!AE9","v":"Café / hôtels / restaurants"},"Hôtellerie/restauration",0,{"$f":"'données d''entrée'!AG9","v":410},{"$f":"'données d''entrée'!AH9","v":520}]
[null,{"$f":"'données d''entrée'!Y10","v":"Hopitaux / cliniques"},"Santé",0,{"$f":"'données d''entrée'!AA10","v":400},{"$f":"'données d''entrée'!AB10","v":540},null,{"$f":"'données d''entrée'!AE10","v":"Hopitaux / cliniques"},"Santé",0,{"$f":"'données d''entrée'!AG10","v":310},{"$f":"'données d''entrée'!AH10","v":410}]
[null,{"$f":"'données d''entrée'!Y11","v":"Commerces"},"Commerces",0,{"$f":"'données d''entrée'!AA11","v":370},{"$f":"'données d''entrée'!AB11","v":420},null,{"$f":"'données d''entrée'!AE11","v":"Commerces"},"Commerces",0,{"$f":"'données d''entrée'!AG11","v":280},{"$f":"'données d''entrée'!AH11","v":320}]
[null,{"$f":"'données d''entrée'!Y12","v":"Sports, culture, Loisirs et Equipements sportifs (SCLE)"},"Autres",0,{"$f":"'données d''entrée'!AA12","v":310},{"$f":"'données d''entrée'!AB12","v":330},null,{"$f":"'données d''entrée'!AE12","v":"Sports, culture, Loisirs et Equipements sportifs (SCLE)"},"Autres",0,{"$f":"'données d''entrée'!AG12","v":240},{"$f":"'données d''entrée'!AH12","v":260},null,null,null,null,"Coût du MWh utile en année 5"]
[null,{"$f":"'données d''entrée'!Y13","v":"Piscine"},"Autres",0,{"$f":"'données d''entrée'!AA13","v":310},{"$f":"'données d''entrée'!AB13","v":330},null,{"$f":"'données d''entrée'!AE13","v":"Piscine"},"Autres",0,{"$f":"'données d''entrée'!AG13","v":240},{"$f":"'données d''entrée'!AH13","v":260}]
[null,{"$f":"'données d''entrée'!Y14","v":"Bâtiments tertiaires mixtes"},"Autres",0,{"$f":"'données d''entrée'!AA14","v":310},{"$f":"'données d''entrée'!AB14","v":330},null,{"$f":"'données d''entrée'!AE14","v":"Bâtiments tertiaires mixtes"},"Autres",0,{"$f":"'données d''entrée'!AG14","v":240},{"$f":"'données d''entrée'!AH14","v":260},null,null,null,null,null,"coût du MWh utile",null,"dépenses totales"]
[null,null,null,null,null,null,null,null,null,null,null,null,null,null,null,null,null,"bois","référence","bois","référence"]
[null,null,null,null,null,null,null,null,null,null,null,null,null,null,null,null,"P1 - énergie bois",{"$f":"IF($F$102=0,0,T209/$F$102)","v":0},{"$f":"IF($AY$39=0,0,U209/$F$102)","v":0},{"$f":"R186","v":0},0]
[null,null,null,null,null,null,null,null,null,null,null,null,null,null,null,null,"P1 - énergie appoint/ref",{"$f":"IF($F$102=0,0,T210/$F$102)","v":0},{"$f":"IF($AY$39=0,0,U210/$F$102)","v":0},{"$f":"S186","v":0},{"$f":"X186","v":0}]
[null,null,null,null,null,null,null,null,null,null,null,null,null,null,null,null,"P2 + P3 maintenance et GER",{"$f":"IF($F$102=0,0,T211/$F$102)","v":0},{"$f":"IF($AY$39=0,0,U211/$F$102)","v":0},{"$f":"T186","v":0},{"$f":"Y186","v":0}]
[]
[null,null,null,null,null,null,null,null,null,null,null,null,null,null,null,null,"P4 - amortissements",{"$f":"IF($F$102=0,0,T213/$F$102)","v":0},{"$f":"IF($AY$39=0,0,U213/$F$102)","v":0},{"$f":"V186","v":{"$error":"#VALUE!"}},{"$f":"AA186","v":{"$error":"#VALUE!"}}]
[null,null,null,null,null,null,null,null,null,null,null,null,null,null,null,null,"TOTAL",{"$f":"SUM(R209:R213)","v":0},{"$f":"SUM(S209:S213)","v":0},{"$f":"SUM(T209:T213)","v":{"$error":"#VALUE!"}},{"$f":"SUM(U209:U213)","v":{"$error":"#VALUE!"}}]
[null,null,null,null,null,null,null,null,null,null,null,null,null,null,null,null,{"$f":"IF(W7=\"oui\",IF(W8=\"oui\",\"\",\"TVA (si vente chaleur)\"),\"\")","v":""},{"$f":"IF(W7=\"oui\",IF(W8=\"oui\",\"\",0.055*R214),\"\")","v":""},{"$f":"IF(W7=\"oui\",IF(W8=\"oui\",\"\",0.2*S214),\"\")","v":""}]
[null,null,null,null,null,null,null,null,null,null,null,null,null,null,null,null,{"$f":"IF(W7=\"oui\",IF(W8=\"oui\",\"\",\"TOTAL TTC\"),\"\")","v":""},{"$f":"IF(W7=\"oui\",IF(W8=\"oui\",\"\",R214+R215),\"\")","v":""},{"$f":"IF(W7=\"oui\",IF(W8=\"oui\",\"\",S214+S215),\"\")","v":""}]

{"sheet":"Synthèse","index":5,"n_rows":50,"n_cols":6,"rows_kept":50,"cut":false,"hidden":false,"merged":[[0,0,0,5],[1,0,2,0],[49,0,49,5]]}
[{"$f":"'données d''entrée'!E1","v":"installation d'une chaufferie bois  - [nom du projet] à [lieu du projet]"}]
["SYNTHESE de l'ETUDE OPPORTUNITE REALISEE PAR VOTRE RELAIS BOIS ENERGIE",null,"Scénario 1","Scénario 2","Scénario 3","Scénario référence"]
[null,null,{"$f":"TITRESCENARIO1","v":"Scénario 1"},{"$f":"TITRESCENARIO2","v":"Scénario 2"},{"$f":"TITRESCENARIO3","v":"Scénario 3"},"à préciser"]
["Date, Auteur",null,{"$f":"DETAILSCENARIO1","v":0},{"$f":"DETAILSCENARIO2","v":0},{"$f":"DETAILSCENARIO3","v":0},"à préciser"]
[null,"Cocher le scénario RETENU","x"]
["Equipements à chauffer",null,{"$f":"CONCATENATE('Scénario 1'!D9,\" \",'Scénario 1'!D10,\" \",'Scénario 1'!D11,\" \",'Scénario 1'!D12,\" \",'Scénario 1'!D13,\" \",'Scénario 1'!D14,\" \",'Scénario 1'!D15,\" \",'Scénario 1'!D16,\" \",'Scénario 1'!D17,\" \",'Scénario 1'!D18,\" \",'Scénario 1'!D19,\" \",'Scénario 1'!D20,\" \",'Scénario 1'!D21,\" \",'Scénario 1'!D22,\" \",'Scénario 1'!D23,\" \",'Scénario 1'!D24,\" \",'Scénario 1'!D25,\" \",'Scénario 1'!D26,\" \",'Scénario 1'!D27,\" \",'Scénario 1'!D28,\" \",'Scénario 1'!D29,\" \",'Scénario 1'!D30,\" \",'Scénario 1'!D32,\" \",'Scénario 1'!D33,\" \")","v":"                                                "},{"$f":"CONCATENATE('Scénario 2'!D9,\" \",'Scénario 2'!D10,\" \",'Scénario 2'!D11,\" \",'Scénario 2'!D12,\" \",'Scénario 2'!D13,\" \",'Scénario 2'!D14,\" \",'Scénario 2'!D15,\" \",'Scénario 2'!D16,\" \",'Scénario 2'!D17,\" \",'Scénario 2'!D18,\" \",'Scénario 2'!D19,\" \",'Scénario 2'!D20,\" \",'Scénario 2'!D21,\" \",'Scénario 2'!D22,\" \",'Scénario 2'!D23,\" \",'Scénario 2'!D24,\" \",'Scénario 2'!D25,\" \",'Scénario 2'!D26,\" \",'Scénario 2'!D27,\" \",'Scénario 2'!D28,\" \",'Scénario 2'!D29,\" \",'Scénario 2'!D30,\" \",'Scénario 2'!D32,\" \",'Scénario 2'!D33,\" \")","v":"                                                "},{"$f":"CONCATENATE('Scénario 3'!D9,\" \",'Scénario 3'!D10,\" \",'Scénario 3'!D11,\" \",'Scénario 3'!D12,\" \",'Scénario 3'!D13,\" \",'Scénario 3'!D14,\" \",'Scénario 3'!D15,\" \",'Scénario 3'!D16,\" \",'Scénario 3'!D17,\" \",'Scénario 3'!D18,\" \",'Scénario 3'!D19,\" \",'Scénario 3'!D20,\" \",'Scénario 3'!D21,\" \",'Scénario 3'!D22,\" \",'Scénario 3'!D23,\" \",'Scénario 3'!D24,\" \",'Scénario 3'!D25,\" \",'Scénario 3'!D26,\" \",'Scénario 3'!D27,\" \",'Scénario 3'!D28,\" \",'Scénario 3'!D29,\" \",'Scénario 3'!D30,\" \",'Scénario 3'!D32,\" \",'Scénario 3'!D33,\" \")","v":"                                                "},{"$f":"C6","v":"                                                "}]
["indicateur (à définir) : ex :surface chauffée","m²",{"$f":"SUM('Scénario 1'!C35:C35)","v":0},{"$f":"SUM('Scénario 2'!C35:C35)","v":0},{"$f":"SUM('Scénario 3'!C35:C35)","v":0},{"$f":"C7","v":0}]
["Besoin thermique à couvrir","MWh",{"$f":"'Scénario 1'!F102","v":0},{"$f":"'Scénario 2'!F102","v":0},{"$f":"'Scénario 3'!F102","v":0},{"$f":"C8","v":0}]
["Taux de couverture bois",null,{"$f":"'Scénario 1'!E103","v":0},{"$f":"'Scénario 2'!E103","v":0},{"$f":"'Scénario 3'!E103","v":0},1]
["Production sortie chaudière bois","MWh",{"$f":"'Scénario 1'!F103","v":0},{"$f":"'Scénario 2'!F103","v":0},{"$f":"'Scénario 3'!F103","v":0}]
["Consommation de bois","MWh",{"$f":"'Scénario 1'!C106","v":0},{"$f":"'Scénario 2'!C106","v":0},{"$f":"'Scénario 3'!C106","v":0}]
["Consommation appoint","MWh",{"$f":"'Scénario 1'!C107","v":0},{"$f":"'Scénario 2'!C107","v":0},{"$f":"'Scénario 3'!C107","v":0},{"$f":"SUM('Scénario 1'!G39:G64)","v":0}]
["Longueur tranchée réseau","ml",{"$f":"'Scénario 1'!D190","v":0},{"$f":"'Scénario 2'!D190","v":0},{"$f":"'Scénario 3'!D190","v":0}]
["Déperdition","MWh",{"$f":"'Scénario 1'!F109","v":0},{"$f":"'Scénario 2'!F109","v":0},{"$f":"'Scénario 3'!F109","v":0}]
["Densité thermique réseau","MWh/ml",{"$f":"'Scénario 1'!F166","v":""},{"$f":"'Scénario 2'!F166","v":""},{"$f":"'Scénario 3'!F166","v":""}]
[]
["Puissance bois installée","kW",{"$f":"'Scénario 1'!C99","v":0},{"$f":"'Scénario 2'!C99","v":0},{"$f":"'Scénario 3'!C99","v":0}]
["Puissance appoint","kW",{"$f":"'Scénario 1'!C100","v":0},{"$f":"'Scénario 2'!C100","v":0},{"$f":"'Scénario 3'!C100","v":0}]
["Nombre Heure équivalent Pleine puissance Bois","h",{"$f":"'Scénario 1'!F99","v":0},{"$f":"'Scénario 2'!F99","v":0},{"$f":"'Scénario 3'!F99","v":0}]
[]
["Type de combustible",null,{"$f":"'Scénario 1'!AA107","v":"granulés"},{"$f":"'Scénario 2'!AA107","v":"granulés"},{"$f":"'Scénario 3'!AA107","v":"granulés"}]
["Consommation de bois","tonnes",{"$f":"'Scénario 1'!E106","v":0},{"$f":"'Scénario 2'!E106","v":0},{"$f":"'Scénario 3'!E106","v":0}]
["Type d'énergie appoint",null,{"$f":"'Scénario 1'!C104","v":0},{"$f":"'Scénario 2'!C104","v":0},{"$f":"'Scénario 3'!C104","v":0}]
[]
["CO2 évités","tonnes",{"$f":"'Scénario 1'!AA111","v":0},{"$f":"'Scénario 2'!AA111","v":0},{"$f":"'Scénario 3'!AA111","v":0}]
[]
["Investissement production chaleur",null,12,{"$f":"'Scénario 2'!S76+'Scénario 2'!S80+'Scénario 2'!S83","v":0},{"$f":"'Scénario 3'!S76+'Scénario 3'!S80+'Scénario 3'!S83","v":0},{"$f":"'Scénario 1'!R63","v":0}]
["Investissement Réseau de chaleur",null,13,{"$f":"'Scénario 2'!S87","v":0},{"$f":"'Scénario 3'!S87","v":0}]
["Ingénierie",null,14,{"$f":"'Scénario 2'!S93","v":0},{"$f":"'Scénario 3'!S93","v":0}]
["Total investissement",null,{"$f":"'Scénario 1'!S95","v":0},{"$f":"'Scénario 2'!S95","v":0},{"$f":"'Scénario 3'!S95","v":0},{"$f":"F27","v":0}]
["Autre",null,0,0,0]
["Aide à la production d'énergie",null,{"$f":"'Scénario 1'!T106","v":0},{"$f":"'Scénario 2'!T106","v":0},{"$f":"'Scénario 3'!T106","v":0}]
["Aide Réseau de chaleur",null,{"$f":"'Scénario 1'!T111","v":0},{"$f":"'Scénario 2'!T111","v":0},{"$f":"'Scénario 3'!T111","v":0}]
["Total investissement aide déduite",null,{"$f":"'Scénario 1'!U95","v":0},{"$f":"'Scénario 2'!U95","v":0},{"$f":"'Scénario 3'!U95","v":0},{"$f":"F30","v":0}]
["% aide total sur l'investissement",null,{"$f":"'Scénario 1'!U116","v":0},{"$f":"'Scénario 2'!U116","v":0},{"$f":"'Scénario 3'!U116","v":0}]
[]
["P1 - énergie","€/an",{"$f":"'Scénario 1'!AB70","v":0},{"$f":"'Scénario 2'!AB70","v":0},{"$f":"'Scénario 3'!AB70","v":0},{"$f":"'Scénario 1'!T63","v":0}]
["P2 - maintenance et électricité","€/an",{"$f":"'Scénario 1'!AB73","v":0},{"$f":"'Scénario 2'!AB73","v":0},{"$f":"'Scénario 3'!AB73","v":0},{"$f":"'Scénario 1'!U63","v":0}]
["P3 - gros entretien","€/an",{"$f":"'Scénario 1'!AB78","v":0},{"$f":"'Scénario 2'!AB78","v":0},{"$f":"'Scénario 3'!AB78","v":0},{"$f":"'Scénario 1'!V63","v":0}]
["Total coût de fonctionnement ","€/an",{"$f":"SUM(C37:C39)","v":0},{"$f":"SUM(D37:D39)","v":0},{"$f":"SUM(E37:E39)","v":0},{"$f":"SUM(F37:F39)","v":0}]
["P4 - amortissements","€/an",{"$f":"'Scénario 1'!AB81","v":{"$error":"#NUM!"}},{"$f":"'Scénario 2'!AB81","v":{"$error":"#NUM!"}},{"$f":"'Scénario 3'!AB81","v":{"$error":"#NUM!"}},{"$f":"'Scénario 1'!W63","v":0}]
["Total fonctionnement et amortissement","€/an",{"$f":"SUM(C40:C41)","v":{"$error":"#NUM!"}},{"$f":"SUM(D40:D41)","v":{"$error":"#NUM!"}},{"$f":"SUM(E40:E41)","v":{"$error":"#NUM!"}},{"$f":"SUM(F40:F41)","v":0}]
[]
["Economie de fonctionnement / solution de référence année 1",null,{"$f":"'Scénario 1'!AA99","v":0},{"$f":"'Scénario 2'!AA99","v":0},{"$f":"'Scénario 3'!AA99","v":0}]
["Economie cumulée sur 10 ans (inflation comprise)",null,{"$f":"'Scénario 1'!AE190","v":0},{"$f":"'Scénario 2'!AE190","v":0},{"$f":"'Scénario 3'!AE190","v":0}]
[]
["Indicateurs"]
["temps de retour actualisé inflation comprise","années",{"$f":"'Scénario 1'!AA102","v":">20 ans"},{"$f":"'Scénario 2'!AA102","v":">20 ans"},{"$f":"'Scénario 3'!AA102","v":">20 ans"}]
[]
["Cette étude a été réalisée par AILE/relais afin d'aider à la décision. \nElle peut être suivie d'une étude de dimensionnement et d'avant projet par un bureau d'étude compétent OPQIBI 20.08 pour valider sa faisabilité. Cette étude peut recevoir une aide de 70% à 80% dans le cadre du Plan Bois Energie Bretagne. La demande doit être faite avant de démarrer l'étude. Contacter AILE ou votre relais Bois énergie.\nCette analyse est construite sur la base des données de consommation fournies par xxxxxxxxxxxxxxxxxxx et sur la base d'une estimation économique à partir de xxxxxxxxxxxxxxxxxxxxxxxxxxxxx."]

{"sheet":"Synthèse pour trame","index":6,"n_rows":113,"n_cols":23,"rows_kept":113,"cut":false,"hidden":false,"merged":[[112,0,112,1],[112,3,112,4],[112,6,112,7],[107,0,107,1],[107,3,107,4],[107,6,107,7],[110,0,110,1],[110,3,110,4],[110,6,110,7],[111,0,111,1],[111,3,111,4],[111,6,111,7],[108,0,108,1],[108,3,108,4],[108,6,108,7],[109,0,109,1],[109,3,109,4],[109,6,109,7],[105,0,105,1],[105,3,105,4],[105,6,105,7],[106,0,106,1],[106,3,106,4],[106,6,106,7],[103,0,103,2],[103,3,103,5],[103,6,103,8],[104,0,104,1],[104,3,104,4],[104,6,104,7],[79,3,79,6],[101,0,101,14],[0,0,0,8],[0,10,0,17],[33,0,33,8],[28,1,28,2],[28,3,28,4],[28,5,28,6],[29,1,29,2],[29,3,29,4],[29,5,29,6],[49,0,49,8],[92,0,92,1],[98,0,98,1],[91,0,91,2],[93,0,93,1],[89,0,89,14],[80,9,81,10],[98,6,98,7],[94,0,94,1],[95,0,95,1],[96,0,96,1],[97,0,97,1],[96,3,96,4],[77,17,77,23],[97,3,97,4],[98,3,98,4],[91,6,91,8],[92,6,92,7],[93,6,93,7],[94,6,94,7],[95,6,95,7],[96,6,96,7],[97,6,97,7],[91,3,91,5],[92,3,92,4],[93,3,93,4],[94,3,94,4],[95,3,95,4],[78,0,78,14]]}
["Situation actuelle",null,null,null,null,null,null,null,null,null,"Besoins et référence"]
["Bâtiment(s)","Surface à chauffer (m2)","Energie actuelle utilisée","Puissance installée (kW)","Consommation moyenne sur 3 ans\n( chauffage + ECS ; MWh PCI)","Dont consommation d'ECS (si non connue, 0)","Rendement de production de l'installation actuelle","Besoin utile (MWh)","Année installation",null,"Bâtiment(s)","Nature des travaux envisagés sur la production de chauffage","Energie de référence choisie","Economies d'énergie (% de réduction)","Puissance de référence (kW)","Conso de référence (après rénovation) MWh PCI","Rendement de production","Besoin utile MWh"]
[{"$f":"'données d''entrée'!D11","v":0},{"$f":"'données d''entrée'!E11","v":0},{"$f":"'données d''entrée'!F11","v":0},{"$f":"'données d''entrée'!G11","v":0},{"$f":"'données d''entrée'!H11","v":0},{"$f":"'données d''entrée'!I11","v":0},{"$f":"'données d''entrée'!J11","v":0},{"$f":"'données d''entrée'!K11","v":0},{"$f":"'données d''entrée'!M11","v":0},null,{"$f":"'données d''entrée'!D11","v":0},{"$f":"'Scénario 1'!C39","v":0},{"$f":"'Scénario 1'!D39","v":0},{"$f":"'Scénario 1'!E39","v":0},{"$f":"'Scénario 1'!F39","v":0},{"$f":"IFERROR('Scénario 1'!G39+'Scénario 1'!H39,0)","v":0},{"$f":"'Scénario 1'!I39","v":""},{"$f":"'Scénario 1'!J39","v":""}]
[{"$f":"'données d''entrée'!D12","v":0},{"$f":"'données d''entrée'!E12","v":0},{"$f":"'données d''entrée'!F12","v":0},{"$f":"'données d''entrée'!G12","v":0},{"$f":"'données d''entrée'!H12","v":0},{"$f":"'données d''entrée'!I12","v":0},{"$f":"'données d''entrée'!J12","v":0},{"$f":"'données d''entrée'!K12","v":0},{"$f":"'données d''entrée'!M12","v":0},null,{"$f":"'données d''entrée'!D12","v":0},{"$f":"'Scénario 1'!C40","v":0},{"$f":"'Scénario 1'!D40","v":0},{"$f":"'Scénario 1'!E40","v":0},{"$f":"'Scénario 1'!F40","v":0},{"$f":"IFERROR('Scénario 1'!G40+'Scénario 1'!H40,0)","v":0},{"$f":"'Scénario 1'!I40","v":""},{"$f":"'Scénario 1'!J40","v":""}]
[{"$f":"'données d''entrée'!D13","v":0},{"$f":"'données d''entrée'!E13","v":0},{"$f":"'données d''entrée'!F13","v":0},{"$f":"'données d''entrée'!G13","v":0},{"$f":"'données d''entrée'!H13","v":0},{"$f":"'données d''entrée'!I13","v":0},{"$f":"'données d''entrée'!J13","v":0},{"$f":"'données d''entrée'!K13","v":0},{"$f":"'données d''entrée'!M13","v":0},null,{"$f":"'données d''entrée'!D13","v":0},{"$f":"'Scénario 1'!C41","v":0},{"$f":"'Scénario 1'!D41","v":0},{"$f":"'Scénario 1'!E41","v":0},{"$f":"'Scénario 1'!F41","v":0},{"$f":"IFERROR('Scénario 1'!G41+'Scénario 1'!H41,0)","v":0},{"$f":"'Scénario 1'!I41","v":""},{"$f":"'Scénario 1'!J41","v":""}]
[{"$f":"'données d''entrée'!D14","v":0},{"$f":"'données d''entrée'!E14","v":0},{"$f":"'données d''entrée'!F14","v":0},{"$f":"'données d''entrée'!G14","v":0},{"$f":"'données d''entrée'!H14","v":0},{"$f":"'données d''entrée'!I14","v":0},{"$f":"'données d''entrée'!J14","v":0},{"$f":"'données d''entrée'!K14","v":0},{"$f":"'données d''entrée'!M14","v":0},null,{"$f":"'données d''entrée'!D14","v":0},{"$f":"'Scénario 1'!C42","v":0},{"$f":"'Scénario 1'!D42","v":0},{"$f":"'Scénario 1'!E42","v":0},{"$f":"'Scénario 1'!F42","v":0},{"$f":"IFERROR('Scénario 1'!G42+'Scénario 1'!H42,0)","v":0},{"$f":"'Scénario 1'!I42","v":""},{"$f":"'Scénario 1'!J42","v":""}]
[{"$f":"'données d''entrée'!D15","v":0},{"$f":"'données d''entrée'!E15","v":0},{"$f":"'données d''entrée'!F15","v":0},{"$f":"'données d''entrée'!G15","v":0},{"$f":"'données d''entrée'!H15","v":0},{"$f":"'données d''entrée'!I15","v":0},{"$f":"'données d''entrée'!J15","v":0},{"$f":"'données d''entrée'!K15","v":0},{"$f":"'données d''entrée'!M15","v":0},null,{"$f":"'données d''entrée'!D15","v":0},{"$f":"'Scénario 1'!C43","v":0},{"$f":"'Scénario 1'!D43","v":0},{"$f":"'Scénario 1'!E43","v":0},{"$f":"'Scénario 1'!F43","v":0},{"$f":"IFERROR('Scénario 1'!G43+'Scénario 1'!H43,0)","v":0},{"$f":"'Scénario 1'!I43","v":""},{"$f":"'Scénario 1'!J43","v":""}]
[{"$f":"'données d''entrée'!D16","v":0},{"$f":"'données d''entrée'!E16","v":0},{"$f":"'données d''entrée'!F16","v":0},{"$f":"'données d''entrée'!G16","v":0},{"$f":"'données d''entrée'!H16","v":0},{"$f":"'données d''entrée'!I16","v":0},{"$f":"'données d''entrée'!J16","v":0},{"$f":"'données d''entrée'!K16","v":0},{"$f":"'données d''entrée'!M16","v":0},null,{"$f":"'données d''entrée'!D16","v":0},{"$f":"'Scénario 1'!C44","v":0},{"$f":"'Scénario 1'!D44","v":0},{"$f":"'Scénario 1'!E44","v":0},{"$f":"'Scénario 1'!F44","v":0},{"$f":"IFERROR('Scénario 1'!G44+'Scénario 1'!H44,0)","v":0},{"$f":"'Scénario 1'!I44","v":""},{"$f":"'Scénario 1'!J44","v":""}]
[{"$f":"'données d''entrée'!D17","v":0},{"$f":"'données d''entrée'!E17","v":0},{"$f":"'données d''entrée'!F17","v":0},{"$f":"'données d''entrée'!G17","v":0},{"$f":"'données d''entrée'!H17","v":0},{"$f":"'données d''entrée'!I17","v":0},{"$f":"'données d''entrée'!J17","v":0},{"$f":"'données d''entrée'!K17","v":0},{"$f":"'données d''entrée'!M17","v":0},null,{"$f":"'données d''entrée'!D17","v":0},{"$f":"'Scénario 1'!C45","v":0},{"$f":"'Scénario 1'!D45","v":0},{"$f":"'Scénario 1'!E45","v":0},{"$f":"'Scénario 1'!F45","v":0},{"$f":"IFERROR('Scénario 1'!G45+'Scénario 1'!H45,0)","v":0},{"$f":"'Scénario 1'!I45","v":""},{"$f":"'Scénario 1'!J45","v":""}]
[{"$f":"'données d''entrée'!D18","v":0},{"$f":"'données d''entrée'!E18","v":0},{"$f":"'données d''entrée'!F18","v":0},{"$f":"'données d''entrée'!G18","v":0},{"$f":"'données d''entrée'!H18","v":0},{"$f":"'données d''entrée'!I18","v":0},{"$f":"'données d''entrée'!J18","v":0},{"$f":"'données d''entrée'!K18","v":0},{"$f":"'données d''entrée'!M18","v":0},null,{"$f":"'données d''entrée'!D18","v":0},{"$f":"'Scénario 1'!C46","v":0},{"$f":"'Scénario 1'!D46","v":0},{"$f":"'Scénario 1'!E46","v":0},{"$f":"'Scénario 1'!F46","v":0},{"$f":"IFERROR('Scénario 1'!G46+'Scénario 1'!H46,0)","v":0},{"$f":"'Scénario 1'!I46","v":""},{"$f":"'Scénario 1'!J46","v":""}]
[{"$f":"'données d''entrée'!D19","v":0},{"$f":"'données d''entrée'!E19","v":0},{"$f":"'données d''entrée'!F19","v":0},{"$f":"'données d''entrée'!G19","v":0},{"$f":"'données d''entrée'!H19","v":0},{"$f":"'données d''entrée'!I19","v":0},{"$f":"'données d''entrée'!J19","v":0},{"$f":"'données d''entrée'!K19","v":0},{"$f":"'données d''entrée'!M19","v":0},null,{"$f":"'données d''entrée'!D19","v":0},{"$f":"'Scénario 1'!C47","v":0},{"$f":"'Scénario 1'!D47","v":0},{"$f":"'Scénario 1'!E47","v":0},{"$f":"'Scénario 1'!F47","v":0},{"$f":"IFERROR('Scénario 1'!G47+'Scénario 1'!H47,0)","v":0},{"$f":"'Scénario 1'!I47","v":""},{"$f":"'Scénario 1'!J47","v":""}]
[{"$f":"'données d''entrée'!D20","v":0},{"$f":"'données d''entrée'!E20","v":0},{"$f":"'données d''entrée'!F20","v":0},{"$f":"'données d''entrée'!G20","v":0},{"$f":"'données d''entrée'!H20","v":0},{"$f":"'données d''entrée'!I20","v":0},{"$f":"'données d''entrée'!J20","v":0},{"$f":"'données d''entrée'!K20","v":0},{"$f":"'données d''entrée'!M20","v":0},null,{"$f":"'données d''entrée'!D20","v":0},{"$f":"'Scénario 1'!C48","v":0},{"$f":"'Scénario 1'!D48","v":0},{"$f":"'Scénario 1'!E48","v":0},{"$f":"'Scénario 1'!F48","v":0},{"$f":"IFERROR('Scénario 1'!G48+'Scénario 1'!H48,0)","v":0},{"$f":"'Scénario 1'!I48","v":""},{"$f":"'Scénario 1'!J48","v":""}]
[{"$f":"'données d''entrée'!D21","v":0},{"$f":"'données d''entrée'!E21","v":0},{"$f":"'données d''entrée'!F21","v":0},{"$f":"'données d''entrée'!G21","v":0},{"$f":"'données d''entrée'!H21","v":0},{"$f":"'données d''entrée'!I21","v":0},{"$f":"'données d''entrée'!J21","v":0},{"$f":"'données d''entrée'!K21","v":0},{"$f":"'données d''entrée'!M21","v":0},null,{"$f":"'données d''entrée'!D21","v":0},{"$f":"'Scénario 1'!C49","v":0},{"$f":"'Scénario 1'!D49","v":0},{"$f":"'Scénario 1'!E49","v":0},{"$f":"'Scénario 1'!F49","v":0},{"$f":"IFERROR('Scénario 1'!G49+'Scénario 1'!H49,0)","v":0},{"$f":"'Scénario 1'!I49","v":""},{"$f":"'Scénario 1'!J49","v":""}]
[{"$f":"'données d''entrée'!D22","v":0},{"$f":"'données d''entrée'!E22","v":0},{"$f":"'données d''entrée'!F22","v":0},{"$f":"'données d''entrée'!G22","v":0},{"$f":"'données d''entrée'!H22","v":0},{"$f":"'données d''entrée'!I22","v":0},{"$f":"'données d''entrée'!J22","v":0},{"$f":"'données d''entrée'!K22","v":0},{"$f":"'données d''entrée'!M22","v":0},null,{"$f":"'données d''entrée'!D22","v":0},{"$f":"'Scénario 1'!C50","v":0},{"$f":"'Scénario 1'!D50","v":0},{"$f":"'Scénario 1'!E50","v":0},{"$f":"'Scénario 1'!F50","v":0},{"$f":"IFERROR('Scénario 1'!G50+'Scénario 1'!H50,0)","v":0},{"$f":"'Scénario 1'!I50","v":""},{"$f":"'Scénario 1'!J50","v":""}]
[{"$f":"'données d''entrée'!D23","v":0},{"$f":"'données d''entrée'!E23","v":0},{"$f":"'données d''entrée'!F23","v":0},{"$f":"'données d''entrée'!G23","v":0},{"$f":"'données d''entrée'!H23","v":0},{"$f":"'données d''entrée'!I23","v":0},{"$f":"'données d''entrée'!J23","v":0},{"$f":"'données d''entrée'!K23","v":0},{"$f":"'données d''entrée'!M23","v":0},null,{"$f":"'données d''entrée'!D23","v":0},{"$f":"'Scénario 1'!C51","v":0},{"$f":"'Scénario 1'!D51","v":0},{"$f":"'Scénario 1'!E51","v":0},{"$f":"'Scénario 1'!F51","v":0},{"$f":"IFERROR('Scénario 1'!G51+'Scénario 1'!H51,0)","v":0},{"$f":"'Scénario 1'!I51","v":""},{"$f":"'Scénario 1'!J51","v":""}]
[{"$f":"'données d''entrée'!D24","v":0},{"$f":"'données d''entrée'!E24","v":0},{"$f":"'données d''entrée'!F24","v":0},{"$f":"'données d''entrée'!G24","v":0},{"$f":"'données d''entrée'!H24","v":0},{"$f":"'données d''entrée'!I24","v":0},{"$f":"'données d''entrée'!J24","v":0},{"$f":"'données d''entrée'!K24","v":0},{"$f":"'données d''entrée'!M24","v":0},null,{"$f":"'données d''entrée'!D24","v":0},{"$f":"'Scénario 1'!C52","v":0},{"$f":"'Scénario 1'!D52","v":0},{"$f":"'Scénario 1'!E52","v":0},{"$f":"'Scénario 1'!F52","v":0},{"$f":"IFERROR('Scénario 1'!G52+'Scénario 1'!H52,0)","v":0},{"$f":"'Scénario 1'!I52","v":""},{"$f":"'Scénario 1'!J52","v":""}]
[{"$f":"'données d''entrée'!D25","v":0},{"$f":"'données d''entrée'!E25","v":0},{"$f":"'données d''entrée'!F25","v":0},{"$f":"'données d''entrée'!G25","v":0},{"$f":"'données d''entrée'!H25","v":0},{"$f":"'données d''entrée'!I25","v":0},{"$f":"'données d''entrée'!J25","v":0},{"$f":"'données d''entrée'!K25","v":0},{"$f":"'données d''entrée'!M25","v":0},null,{"$f":"'données d''entrée'!D25","v":0},{"$f":"'Scénario 1'!C53","v":0},{"$f":"'Scénario 1'!D53","v":0},{"$f":"'Scénario 1'!E53","v":0},{"$f":"'Scénario 1'!F53","v":0},{"$f":"IFERROR('Scénario 1'!G53+'Scénario 1'!H53,0)","v":0},{"$f":"'Scénario 1'!I53","v":""},{"$f":"'Scénario 1'!J53","v":""}]
[{"$f":"'données d''entrée'!D26","v":0},{"$f":"'données d''entrée'!E26","v":0},{"$f":"'données d''entrée'!F26","v":0},{"$f":"'données d''entrée'!G26","v":0},{"$f":"'données d''entrée'!H26","v":0},{"$f":"'données d''entrée'!I26","v":0},{"$f":"'données d''entrée'!J26","v":0},{"$f":"'données d''entrée'!K26","v":0},{"$f":"'données d''entrée'!M26","v":0},null,{"$f":"'données d''entrée'!D26","v":0},{"$f":"'Scénario 1'!C54","v":0},{"$f":"'Scénario 1'!D54","v":0},{"$f":"'Scénario 1'!E54","v":0},{"$f":"'Scénario 1'!F54","v":0},{"$f":"IFERROR('Scénario 1'!G54+'Scénario 1'!H54,0)","v":0},{"$f":"'Scénario 1'!I54","v":""},{"$f":"'Scénario 1'!J54","v":""}]
[{"$f":"'données d''entrée'!D27","v":0},{"$f":"'données d''entrée'!E27","v":0},{"$f":"'données d''entrée'!F27","v":0},{"$f":"'données d''entrée'!G27","v":0},{"$f":"'données d''entrée'!H27","v":0},{"$f":"'données d''entrée'!I27","v":0},{"$f":"'données d''entrée'!J27","v":0},{"$f":"'données d''entrée'!K27","v":0},{"$f":"'données d''entrée'!M27","v":0},null,{"$f":"'données d''entrée'!D27","v":0},{"$f":"'Scénario 1'!C55","v":0},{"$f":"'Scénario 1'!D55","v":0},{"$f":"'Scénario 1'!E55","v":0},{"$f":"'Scénario 1'!F55","v":0},{"$f":"IFERROR('Scénario 1'!G55+'Scénario 1'!H55,0)","v":0},{"$f":"'Scénario 1'!I55","v":""},{"$f":"'Scénario 1'!J55","v":""}]
[{"$f":"'données d''entrée'!D28","v":0},{"$f":"'données d''entrée'!E28","v":0},{"$f":"'données d''entrée'!F28","v":0},{"$f":"'données d''entrée'!G28","v":0},{"$f":"'données d''entrée'!H28","v":0},{"$f":"'données d''entrée'!I28","v":0},{"$f":"'données d''entrée'!J28","v":0},{"$f":"'données d''entrée'!K28","v":0},{"$f":"'données d''entrée'!M28","v":0},null,{"$f":"'données d''entrée'!D28","v":0},{"$f":"'Scénario 1'!C56","v":0},{"$f":"'Scénario 1'!D56","v":0},{"$f":"'Scénario 1'!E56","v":0},{"$f":"'Scénario 1'!F56","v":0},{"$f":"IFERROR('Scénario 1'!G56+'Scénario 1'!H56,0)","v":0},{"$f":"'Scénario 1'!I56","v":""},{"$f":"'Scénario 1'!J56","v":""}]
[{"$f":"'données d''entrée'!D29","v":0},{"$f":"'données d''entrée'!E29","v":0},{"$f":"'données d''entrée'!F29","v":0},{"$f":"'données d''entrée'!G29","v":0},{"$f":"'données d''entrée'!H29","v":0},{"$f":"'données d''entrée'!I29","v":0},{"$f":"'données d''entrée'!J29","v":0},{"$f":"'données d''entrée'!K29","v":0},{"$f":"'données d''entrée'!M29","v":0},null,{"$f":"'données d''entrée'!D29","v":0},{"$f":"'Scénario 1'!C57","v":0},{"$f":"'Scénario 1'!D57","v":0},{"$f":"'Scénario 1'!E57","v":0},{"$f":"'Scénario 1'!F57","v":0},{"$f":"IFERROR('Scénario 1'!G57+'Scénario 1'!H57,0)","v":0},{"$f":"'Scénario 1'!I57","v":""},{"$f":"'Scénario 1'!J57","v":""}]
[{"$f":"'données d''entrée'!D30","v":0},{"$f":"'données d''entrée'!E30","v":0},{"$f":"'données d''entrée'!F30","v":0},{"$f":"'données d''entrée'!G30","v":0},{"$f":"'données d''entrée'!H30","v":0},{"$f":"'données d''entrée'!I30","v":0},{"$f":"'données d''entrée'!J30","v":0},{"$f":"'données d''entrée'!K30","v":0},{"$f":"'données d''entrée'!M30","v":0},null,{"$f":"'données d''entrée'!D30","v":0},{"$f":"'Scénario 1'!C58","v":0},{"$f":"'Scénario 1'!D58","v":0},{"$f":"'Scénario 1'!E58","v":0},{"$f":"'Scénario 1'!F58","v":0},{"$f":"IFERROR('Scénario 1'!G58+'Scénario 1'!H58,0)","v":0},{"$f":"'Scénario 1'!I58","v":""},{"$f":"'Scénario 1'!J58","v":""}]
[{"$f":"'données d''entrée'!D31","v":0},{"$f":"'données d''entrée'!E31","v":0},{"$f":"'données d''entrée'!F31","v":0},{"$f":"'données d''entrée'!G31","v":0},{"$f":"'données d''entrée'!H31","v":0},{"$f":"'données d''entrée'!I31","v":0},{"$f":"'données d''entrée'!J31","v":0},{"$f":"'données d''entrée'!K31","v":0},{"$f":"'données d''entrée'!M31","v":0},null,{"$f":"'données d''entrée'!D31","v":0},{"$f":"'Scénario 1'!C59","v":0},{"$f":"'Scénario 1'!D59","v":0},{"$f":"'Scénario 1'!E59","v":0},{"$f":"'Scénario 1'!F59","v":0},{"$f":"IFERROR('Scénario 1'!G59+'Scénario 1'!H59,0)","v":0},{"$f":"'Scénario 1'!I59","v":""},{"$f":"'Scénario 1'!J59","v":""}]
[{"$f":"'données d''entrée'!D32","v":0},{"$f":"'données d''entrée'!E32","v":0},{"$f":"'données d''entrée'!F32","v":0},{"$f":"'données d''entrée'!G32","v":0},{"$f":"'données d''entrée'!H32","v":0},{"$f":"'données d''entrée'!I32","v":0},{"$f":"'données d''entrée'!J32","v":0},{"$f":"'données d''entrée'!K32","v":0},{"$f":"'données d''entrée'!M32","v":0},null,{"$f":"'données d''entrée'!D32","v":0},{"$f":"'Scénario 1'!C60","v":0},{"$f":"'Scénario 1'!D60","v":0},{"$f":"'Scénario 1'!E60","v":0},{"$f":"'Scénario 1'!F60","v":0},{"$f":"IFERROR('Scénario 1'!G60+'Scénario 1'!H60,0)","v":0},{"$f":"'Scénario 1'!I60","v":""},{"$f":"'Scénario 1'!J60","v":""}]
[{"$f":"'données d''entrée'!D33","v":0},{"$f":"'données d''entrée'!E33","v":0},{"$f":"'données d''entrée'!F33","v":0},{"$f":"'données d''entrée'!G33","v":0},{"$f":"'données d''entrée'!H33","v":0},{"$f":"'données d''entrée'!I33","v":0},{"$f":"'données d''entrée'!J33","v":0},{"$f":"'données d''entrée'!K33","v":0},{"$f":"'données d''entrée'!M33","v":0},null,{"$f":"'données d''entrée'!D33","v":0},{"$f":"'Scénario 1'!C61","v":0},{"$f":"'Scénario 1'!D61","v":0},{"$f":"'Scénario 1'!E61","v":0},{"$f":"'Scénario 1'!F61","v":0},{"$f":"IFERROR('Scénario 1'!G61+'Scénario 1'!H61,0)","v":0},{"$f":"'Scénario 1'!I61","v":""},{"$f":"'Scénario 1'!J61","v":""}]
[{"$f":"'données d''entrée'!D34","v":0},{"$f":"'données d''entrée'!E34","v":0},{"$f":"'données d''entrée'!F34","v":0},{"$f":"'données d''entrée'!G34","v":0},{"$f":"'données d''entrée'!H34","v":0},{"$f":"'données d''entrée'!I34","v":0},{"$f":"'données d''entrée'!J34","v":0},{"$f":"'données d''entrée'!K34","v":0},{"$f":"'données d''entrée'!M34","v":0},null,{"$f":"'données d''entrée'!D34","v":0},{"$f":"'Scénario 1'!C62","v":0},{"$f":"'Scénario 1'!D62","v":0},{"$f":"'Scénario 1'!E62","v":0},{"$f":"'Scénario 1'!F62","v":0},{"$f":"IFERROR('Scénario 1'!G62+'Scénario 1'!H62,0)","v":0},{"$f":"'Scénario 1'!I62","v":""},{"$f":"'Scénario 1'!J62","v":""}]
[{"$f":"'données d''entrée'!D35","v":0},{"$f":"'données d''entrée'!E35","v":0},{"$f":"'données d''entrée'!F35","v":0},{"$f":"'données d''entrée'!G35","v":0},{"$f":"'données d''entrée'!H35","v":0},{"$f":"'données d''entrée'!I35","v":0},{"$f":"'données d''entrée'!J35","v":0},{"$f":"'données d''entrée'!K35","v":0},{"$f":"'données d''entrée'!M35","v":0},null,{"$f":"'données d''entrée'!D35","v":0},{"$f":"'Scénario 1'!C63","v":0},{"$f":"'Scénario 1'!D63","v":0},{"$f":"'Scénario 1'!E63","v":0},{"$f":"'Scénario 1'!F63","v":0},{"$f":"IFERROR('Scénario 1'!G63+'Scénario 1'!H63,0)","v":0},{"$f":"'Scénario 1'!I63","v":""},{"$f":"'Scénario 1'!J63","v":""}]
[]
[null,{"$f":"R79","v":"Scénario 1"},null,{"$f":"R80","v":"Scénario 2"},null,{"$f":"R81","v":"Scénario 3"}]
["MWh sortie chaudière",{"$f":"'Scénario 1'!$S$102","v":0},null,{"$f":"'Scénario 2'!$S$102","v":0},null,{"$f":"'Scénario 3'!$S$102","v":0}]
["MWh éligibles",{"$f":"'Scénario 1'!$S$103","v":0},{"$f":"'Scénario 1'!$T$103","v":0},{"$f":"'Scénario 2'!$S$103","v":0},{"$f":"'Scénario 2'!$T$103","v":0},{"$f":"'Scénario 3'!$S$103","v":0},{"$f":"'Scénario 3'!$T$103","v":0}]
[]
[]
["Coûts d'investissement et d'exploitation référence"]
[]
["Référence 1",{"$f":"IF(OR('Scénario 1'!W8=\"oui\",'Scénario 1'!W7=\"oui\"),\"Montant € HTVA\",\"Montant € TTC\")","v":"Montant € HTVA"},"Référence 2",{"$f":"IF(OR('Scénario 2'!W8=\"oui\",'Scénario 2'!W7=\"oui\"),\"Montant € HTVA\",\"Montant € TTC\")","v":"Montant € TTC"},"Référence 3",{"$f":"IF(OR('Scénario 3'!W8=\"oui\",'Scénario 3'!W7=\"oui\"),\"Montant € HTVA\",\"Montant € TTC\")","v":"Montant € TTC"}]
["Total investissement",{"$f":"'Scénario 1'!$R$63","v":0},"Total investissement",{"$f":"'Scénario 2'!$R$63","v":0},"Total investissement",{"$f":"'Scénario 3'!$R$63","v":0}]
["Aide à la production d'énergie",0,"Aide à la production d'énergie",0,"Aide à la production d'énergie",0]
["Aide Réseau de chaleur",0,"Aide Réseau de chaleur",0,"Aide Réseau de chaleur",0]
["Total investissement aide déduite",{"$f":"B37-B38-B39","v":0},"Total investissement aide déduite",{"$f":"D37-D38-D39","v":0},"Total investissement aide déduite",{"$f":"F37-F38-F39","v":0}]
[]
["Référence 1",{"$f":"IF(OR('Scénario 1'!W8=\"oui\",'Scénario 1'!W7=\"oui\"),\"Montant € HTVA\",\"Montant € TTC\")","v":"Montant € HTVA"},"Référence 2",{"$f":"IF(OR('Scénario 2'!W8=\"oui\",'Scénario 2'!W7=\"oui\"),\"Montant € HTVA\",\"Montant € TTC\")","v":"Montant € TTC"},"Référence 3",{"$f":"IF(OR('Scénario 3'!W14=\"oui\",'Scénario 3'!W13=\"oui\"),\"Montant € HTVA\",\"Montant € TTC\")","v":"Montant € TTC"}]
["P1 – énergie",{"$f":"'Scénario 1'!$T$63","v":0},"P1 – énergie",{"$f":"'Scénario 2'!$T$63","v":0},"P1 – énergie",{"$f":"'Scénario 3'!$T$63","v":0}]
["P2 - maintenance et électricité",{"$f":"'Scénario 1'!$U$63","v":0},"P2 - maintenance et électricité",{"$f":"'Scénario 2'!$U$63","v":0},"P2 - maintenance et électricité",{"$f":"'Scénario 3'!$U$63","v":0}]
["P3 - gros entretien",{"$f":"'Scénario 1'!$V$63","v":0},"P3 - gros entretien",{"$f":"'Scénario 2'!$V$63","v":0},"P3 - gros entretien",{"$f":"'Scénario 3'!$V$63","v":0}]
["Total coût de fonctionnement ",{"$f":"SUM(B43:B45)","v":0},"Total coût de fonctionnement ",{"$f":"SUM(D43:D45)","v":0},"Total coût de fonctionnement ",{"$f":"SUM(F43:F45)","v":0}]
["P4 - amortissements",{"$f":"'Scénario 1'!$W$63","v":0},"P4 - amortissements",{"$f":"'Scénario 2'!$W$63","v":0},"P4 - amortissements",{"$f":"'Scénario 3'!$W$63","v":0}]
["Total fonctionnement et amortissement",{"$f":"SUM(B43:B45,B47)","v":0},"Total fonctionnement et amortissement",{"$f":"SUM(D43:D45,D47)","v":0},"Total fonctionnement et amortissement",{"$f":"SUM(F43:F45,F47)","v":0}]
[]
["Coûts d'investissement et d'exploitation Scénarii"]
[]
[{"$f":"R79","v":"Scénario 1"},{"$f":"IF(OR('Scénario 1'!W8=\"oui\",'Scénario 1'!W7=\"oui\"),\"Montant € HTVA\",\"Montant € TTC\")","v":"Montant € HTVA"},"Scénario 2",{"$f":"IF(OR('Scénario 2'!W8=\"oui\",'Scénario 2'!W7=\"oui\"),\"Montant € HTVA\",\"Montant € TTC\")","v":"Montant € TTC"},"Scénario 3",{"$f":"IF(OR('Scénario 3'!W24=\"oui\",'Scénario 3'!W23=\"oui\"),\"Montant € HTVA\",\"Montant € TTC\")","v":"Montant € TTC"}]
["Investissement chaufferie bois et appoint",{"$f":"'Scénario 1'!$S$76","v":0},"Investissement chaufferie bois et appoint",{"$f":"'Scénario 2'!$S$76","v":0},"Investissement chaufferie bois et appoint",{"$f":"'Scénario 3'!$S$76","v":0}]
["Investissement  silo, VRD, génie civil",{"$f":"'Scénario 1'!$S$80+'Scénario 1'!$S$83","v":0},"Investissement  silo, VRD, génie civil",{"$f":"'Scénario 2'!$S$80+'Scénario 2'!$S$83","v":0},"Investissement  silo, VRD, génie civil",{"$f":"'Scénario 3'!$S$80+'Scénario 3'!$S$83","v":0}]
["Investissement  réseau et tranchées",{"$f":"'Scénario 1'!$S$84","v":0},"Investissement  réseau et tranchées",{"$f":"'Scénario 2'!$S$84","v":0},"Investissement  réseau et tranchées",{"$f":"'Scénario 3'!$S$84","v":0}]
["Investissement sous stations",{"$f":"'Scénario 1'!$S$85","v":0},"Investissement sous stations",{"$f":"'Scénario 2'!$S$85","v":0},"Investissement sous stations",{"$f":"'Scénario 3'!$S$85","v":0}]
["Ingénierie (12 %)",{"$f":"'Scénario 1'!$S$93","v":0},"Ingénierie (12 %)",{"$f":"'Scénario 2'!$S$93","v":0},"Ingénierie (12 %)",{"$f":"'Scénario 3'!$S$93","v":0}]
["Total investissement",{"$f":"'Scénario 1'!$S$95","v":0},"Total investissement",{"$f":"'Scénario 2'!$S$95","v":0},"Total investissement",{"$f":"'Scénario 3'!$S$95","v":0}]
["Aide à la production d'énergie",{"$f":"'Scénario 1'!$S$108","v":0},"Aide à la production d'énergie",{"$f":"'Scénario 2'!$S$108","v":0},"Aide à la production d'énergie",{"$f":"'Scénario 3'!$S$108","v":0}]
["Aide Réseau de chaleur",{"$f":"'Scénario 1'!$S$111","v":0},"Aide Réseau de chaleur",{"$f":"'Scénario 2'!$S$111","v":0},"Aide Réseau de chaleur",{"$f":"'Scénario 3'!$S$111","v":0}]
["Aide CEE valorisable",{"$f":"'Scénario 1'!$T$119-'Scénario 1'!$T$116","v":0},"Aide CEE valorisable",{"$f":"'Scénario 2'!$T$119-'Scénario 2'!$T$116","v":0},"Aide CEE valorisable",{"$f":"'Scénario 3'!$T$119-'Scénario 3'!$T$116","v":0}]
["Total investissement aide déduite",{"$f":"'Scénario 1'!$U$95","v":0},"Total investissement aide déduite",{"$f":"'Scénario 2'!$U$95","v":0},"Total investissement aide déduite",{"$f":"'Scénario 3'!$U$95","v":0}]
["% aide total sur l'investissement",{"$f":"'Scénario 1'!$U$119","v":0},"% aide total sur l'investissement",{"$f":"'Scénario 2'!$U$119","v":0},"% aide total sur l'investissement",{"$f":"'Scénario 3'!$U$119","v":0}]
["Surcout d’investissement / solution de référence",{"$f":"'Scénario 1'!$U$97","v":0},"Surcout d’investissement / solution de référence",{"$f":"'Scénario 2'!$U$97","v":0},"Surcout d’investissement / solution de référence",{"$f":"'Scénario 3'!$U$97","v":0}]
[]
[{"$f":"R93","v":0},{"$f":"IF(OR('Scénario 1'!W8=\"oui\",'Scénario 1'!W7=\"oui\"),\"Montant € HTVA\",\"Montant € TTC\")","v":"Montant € HTVA"},"Scénario 2",{"$f":"IF(OR('Scénario 2'!W8=\"oui\",'Scénario 2'!W7=\"oui\"),\"Montant € HTVA\",\"Montant € TTC\")","v":"Montant € TTC"},"Scénario 3",{"$f":"IF(OR('Scénario 3'!W38=\"oui\",'Scénario 3'!W37=\"oui\"),\"Montant € HTVA\",\"Montant € TTC\")","v":"Montant € TTC"}]
["P1 - énergie",{"$f":"'Scénario 1'!$AB$70","v":0},"P1 - énergie",{"$f":"'Scénario 2'!$AB$70","v":0},"P1 - énergie",{"$f":"'Scénario 3'!$AB$70","v":0}]
["P2 - maintenance et électricité",{"$f":"'Scénario 1'!$AB$73","v":0},"P2 - maintenance et électricité",{"$f":"'Scénario 2'!$AB$73","v":0},"P2 - maintenance et électricité",{"$f":"'Scénario 3'!$AB$73","v":0}]
["P3 - gros entretien",{"$f":"'Scénario 1'!$AB$78","v":0},"P3 - gros entretien",{"$f":"'Scénario 2'!$AB$78","v":0},"P3 - gros entretien",{"$f":"'Scénario 3'!$AB$78","v":0}]
["Total coût de fonctionnement ",{"$f":"SUM(B67:B69)","v":0},"Total coût de fonctionnement ",{"$f":"SUM(D67:D69)","v":0},"Total coût de fonctionnement ",{"$f":"SUM(F67:F69)","v":0}]
["P4 - amortissements",{"$f":"'Scénario 1'!$AB$81","v":{"$error":"#NUM!"}},"P4 - amortissements",{"$f":"'Scénario 2'!$AB$81","v":{"$error":"#NUM!"}},"P4 - amortissements",{"$f":"'Scénario 3'!$AB$81","v":{"$error":"#NUM!"}}]
["Total fonctionnement et amortissement",{"$f":"SUM(B67:B69,B71)","v":{"$error":"#NUM!"}},"Total fonctionnement et amortissement",{"$f":"SUM(D67:D69,D71)","v":{"$error":"#NUM!"}},"Total fonctionnement et amortissement",{"$f":"SUM(F67:F69,F71)","v":{"$error":"#NUM!"}}]
[]
["Economie de fonctionnement / solution de référence année 1",{"$f":"'Scénario 1'!$AA$99","v":0},"Economie de fonctionnement / solution de référence année 1",{"$f":"'Scénario 2'!$AA$99","v":0},"Economie de fonctionnement / solution de référence année 1",{"$f":"'Scénario 3'!$AA$99","v":0}]
["Economie cumulée sur 15 ans (inflation comprise)",{"$f":"'Scénario 1'!$AE$196","v":0},"Economie cumulée sur 15 ans (inflation comprise)",{"$f":"'Scénario 2'!$AE$196","v":0},"Economie cumulée sur 15 ans (inflation comprise)",{"$f":"'Scénario 3'!$AE$196","v":0}]
["Temps de retour sur investissement avec subvention (années)",{"$f":"'Scénario 1'!$AA$101","v":""},"Temps de retour sur investissement avec subvention (années)",{"$f":"'Scénario 2'!$AA$101","v":""},"Temps de retour sur investissement avec subvention (années)",{"$f":"'Scénario 2'!$AA$101","v":""}]
["Temps de retour actualisé (années)",{"$f":"'Scénario 1'!$AA$102","v":">20 ans"},"Temps de retour actualisé (années)",{"$f":"'Scénario 2'!$AA$102","v":">20 ans"},"Temps de retour actualisé (années)",{"$f":"'Scénario 2'!$AA$102","v":">20 ans"}]
[null,null,null,null,null,null,null,null,null,null,null,null,null,null,null,null,null,"Pour Macro, ne pas toucher!"]
["Analyse de sensibilité",null,null,null,null,null,null,null,null,null,null,null,null,null,null,null,null,{"$f":"TITRESCENARIO1","v":"Scénario 1"}]
["Scénario 1",null,null,"Analyse de sensibilité : évolution du besoin et de l'investissement bois",null,null,null,null,null,null,null,null,null,null,null,null,null,{"$f":"TITRESCENARIO2","v":"Scénario 2"},null,null,null,"Baisse des besoins pour votre projet?","Non"]
[null,null,null,{"$f":"IF(OR(INDIRECT(\"'\"&$A$80&\"'!V8\")=\"oui\",INDIRECT(\"'\"&$A$80&\"'!V7\")=\"oui\"),\"En €HTVA/MWh\",\"En €TTC/MWh\")","v":"En €TTC/MWh"},"Situation étudiée",-0.1,-0.2,null,{"$f":"IF(OR(INDIRECT(\"'\"&$A$80&\"'!V8\")=\"oui\",INDIRECT(\"'\"&$A$80&\"'!V7\")=\"oui\"),\"En €HTVA/MWh\",\"En €TTC/MWh\")","v":"En €TTC/MWh"},"Situation étudiée",null,-0.1,null,-0.2,null,null,null,{"$f":"TITRESCENARIO3","v":"Scénario 3"},null,null,null,"Baisse considérée? (ex : 20%)",0.2]
["Energie de référence :","fioul",null,"Besoins","Référence","Référence","Référence",null,"Besoins",null,null,null,null,null,null,null,null,null,null,"Ref"]
[null,null,null,"Investissement",146.61979926333606,144.40183771414391,142.5535364231504,null,"Coût de l'énergie de référence","Bois",{"$f":"$B$82","v":"fioul"},"Bois",{"$f":"$B$82","v":"fioul"},"Bois",{"$f":"$B$82","v":"fioul"},null,null,null,null,{"$f":"INDIRECT(\"'\"&$A$80&\"'!R134\")","v":0}]
[null,null,null,"Situation étudiée",280.96883883546531,263.94051019464041,250.28846646367126,null,"Situation étudiée",280.96883883546531,146.61979926333606,263.94051019464041,144.40183771414391,250.28846646367126,142.5535364231504,null,null,null,"Solution",{"$f":"INDIRECT(\"'\"&$A$80&\"'!Q134\")","v":"TOTAL"},null,"Variations besoins",0]
[null,null,null,-0.1,284.08374017306414,266.76338953183938,252.86938471482458,null,-0.1,280.96883883546531,134.39757704111386,263.94051019464041,132.17961549192165,250.28846646367126,130.33131420092818,null,null,null,null,null,null,"Variation investissement",0]
[null,null,null,0.1,287.42950261373949,269.79548674370142,255.64158787995555,null,0.1,280.96883883546531,158.84202148555829,263.94051019464041,156.62405993636611,250.28846646367126,154.77575864537266,null,null,null,null,null,null,"Variation coût énergie référence",0]
[null,null,null,0.2,299.14651425565489,277.22800615240567,260.9562535219365,null,0.2,280.96883883546531,171.06424370778049,263.94051019464041,168.84628215858834,250.28846646367126,166.99798086759486]
[]
[]
["Synthèse environnementale"]
[]
["SYNTHESE SCENARIO 1 BOIS",null,null,"SYNTHESE SCENARIO 2 BOIS",null,null,"SYNTHESE SCENARIO 3 BOIS"]
["tonnes de bois consommées",null,{"$f":"'Scénario 1'!$E$106","v":0},"tonnes de bois consommées",null,{"$f":"'Scénario 2'!$E$106","v":0},"tonnes de bois consommées",null,{"$f":"'Scénario 3'!$E$106","v":0}]
["Origine du combustible",null,{"$f":"'Scénario 1'!$AA$107","v":"granulés"},"Origine du combustible",null,{"$f":"'Scénario 2'!$AA$107","v":"granulés"},"Origine du combustible",null,{"$f":"'Scénario 3'!$AA$107","v":"granulés"}]
["tep EnR consommées",null,{"$f":"'Scénario 1'!$AA$109","v":0},"tep EnR consommées",null,{"$f":"'Scénario 2'!$AA$109","v":0},"tep EnR consommées",null,{"$f":"'Scénario 3'!$AA$109","v":0}]
["Nombre de livraisons",null,{"$f":"'Scénario 1'!$N$102","v":0},"Nombre de livraisons",null,{"$f":"'Scénario 2'!$N$102","v":0},"Nombre de livraisons",null,{"$f":"'Scénario 3'!$N$102","v":0}]
["tonnes de CO2 évitées/an",null,{"$f":"'Scénario 1'!$AA$111","v":0},"tonnes de CO2 évitées/an",null,{"$f":"'Scénario 2'!$AA$111","v":0},"tonnes de CO2 évitées/an",null,{"$f":"'Scénario 3'!$AA$111","v":0}]
["emploi généré en équivalent temps plein",null,{"$f":"'Scénario 1'!$AA$113","v":0},"emploi généré en équivalent temps plein",null,{"$f":"'Scénario 2'!$AA$113","v":0},"emploi généré en équivalent temps plein",null,{"$f":"'Scénario 3'!$AA$113","v":0}]
["économie de fonctionnement supplémentaires injectée dans le territoire",null,{"$f":"'Scénario 1'!$AA$117","v":0},"économie de fonctionnement supplémentaires injectée dans le territoire",null,{"$f":"'Scénario 2'!$AA$117","v":0},"économie de fonctionnement supplémentaires injectée dans le territoire",null,{"$f":"'Scénario 3'!$AA$117","v":0}]
[]
[]
["Synthèse technico-énergétique"]
[]
["SYNTHESE SCENARIO 1 BOIS",null,null,"SYNTHESE SCENARIO 2 BOIS",null,null,"SYNTHESE SCENARIO 3 BOIS"]
["Puissance bois installée (kW)",null,{"$f":"'Scénario 1'!$C$99","v":0},"Puissance bois installée (kW)",null,{"$f":"'Scénario 2'!$C$99","v":0},"Puissance bois installée (kW)",null,{"$f":"'Scénario 3'!$C$99","v":0}]
["Puissance totale installée (kW)",null,{"$f":"'Scénario 1'!$C$100+'Synthèse pour trame'!C$105","v":0},"Puissance totale installée (kW)",null,{"$f":"'Scénario 2'!$C$100+'Synthèse pour trame'!F$105","v":0},"Puissance totale installée (kW)",null,{"$f":"'Scénario 3'!$C$100+'Synthèse pour trame'!I$105","v":0}]
["Puissance totale livrée en sous station (kW)",null,{"$f":"'Scénario 1'!$C$98","v":0},"Puissance totale livrée en sous station (kW)",null,{"$f":"'Scénario 2'!$C$98","v":0},"Puissance totale livrée en sous station (kW)",null,{"$f":"'Scénario 3'!$C$98","v":0}]
["Nombre de sous-stations",null,{"$f":"'Scénario 1'!$R$85","v":0},"Nombre de sous-stations",null,{"$f":"'Scénario 2'!$R$85","v":0},"Nombre de sous-stations",null,{"$f":"'Scénario 3'!$R$85","v":0}]
["Chaleur annuelle produite (MWh)",null,{"$f":"'Scénario 1'!$F$102+'Scénario 1'!$C$118+'Scénario 1'!$F$118","v":0},"Chaleur annuelle produite (MWh)",null,{"$f":"'Scénario 2'!$F$102+'Scénario 2'!$C$118+'Scénario 2'!$F$118","v":0},"Chaleur annuelle produite (MWh)",null,{"$f":"'Scénario 3'!$F$102+'Scénario 3'!$C$118+'Scénario 3'!$F$118","v":0}]
["Taux de couverture EnR (%)",null,{"$f":"'Scénario 1'!$E$103+'Scénario 1'!$C$118/'Scénario 1'!$J$64+'Scénario 1'!$F$118/'Scénario 1'!$J$64","v":{"$error":"#DIV/0!"}},"Taux de couverture EnR (%)",null,{"$f":"'Scénario 2'!$E$103+'Scénario 2'!$C$118/'Scénario 2'!$J$64+'Scénario 2'!$F$118/'Scénario 2'!$J$64","v":{"$error":"#DIV/0!"}},"Taux de couverture EnR (%)",null,{"$f":"'Scénario 3'!$E$103+'Scénario 3'!$C$118/'Scénario 3'!$J$64+'Scénario 3'!$F$118/'Scénario 3'!$J$64","v":{"$error":"#DIV/0!"}}]
["Heures Equivalentes Pleine Puissance (HEPP; h)",null,{"$f":"'Scénario 1'!$AA$115","v":0},"Heures Equivalentes Pleine Puissance (HEPP; h)",null,{"$f":"'Scénario 2'!$AA$115","v":0},"Heures Equivalentes Pleine Puissance (HEPP; h)",null,{"$f":"'Scénario 3'!$AA$115","v":0}]
["Longueur de réseau (m)",null,{"$f":"'Scénario 1'!$R$84","v":0},"Longueur de réseau (m)",null,{"$f":"'Scénario 2'!$R$84","v":0},"Longueur de réseau (m)",null,{"$f":"'Scénario 3'!$R$84","v":0}]
["Densité thermique (MWh/ml de réseau)",null,{"$f":"'Scénario 1'!$F$166","v":""},"Densité thermique (MWh/ml de réseau)",null,{"$f":"'Scénario 2'!$F$166","v":""},"Densité thermique (MWh/ml de réseau)",null,{"$f":"'Scénario 3'!$F$166","v":""}]

{"sheet":"Déficit de financement","index":7,"n_rows":55,"n_cols":22,"rows_kept":55,"cut":false,"hidden":false,"merged":[[0,0,0,30],[12,0,12,1],[22,0,22,1],[26,0,26,21],[1,2,3,2]]}
["Calcul du déficit de financement"]
["Choix du scénario","Scénario 1","Rappel de la liste des scénarios :",{"$f":"[0]!TITRESCENARIO1","v":"Scénario 1"}]
["Calcul du déficit de financement",null,null,{"$f":"[0]!TITRESCENARIO2","v":"Scénario 2"}]
[null,null,null,{"$f":"[0]!TITRESCENARIO3","v":"Scénario 3"}]
[]
[]
["Investissements liés au projet dont production (€)"]
[{"$f":"INDIRECT(\"'\"&B2&\"'!$R$92\")","v":0}]
[]
["Aides prévisionnelles totales (Fonds Chaleur et autres, hors CEE) sur le périmètre du projet (€)"]
[{"$f":"INDIRECT(\"'\"&B2&\"'!$R$113\")","v":0}]
[]
["Charges d’exploitation annuelle (€ HTR)\nDans les cas d'extension, l'ADEME attend des commentaires succincts sur la façon dont la répartition a été faite entre les valeurs relatives au réseau existant et celles, demandées ici, relatives à l'extension exclusivement"]
["P1 € HTR",{"$f":"INDIRECT(\"'\"&B2&\"'!AA69\")","v":0}]
["P'1 € HTR",{"$f":"INDIRECT(\"'\"&B2&\"'!AA71\")","v":"définir le type de combustible en F40"}]
["P2 (charges salariales comprises) € HTR",{"$f":"INDIRECT(\"'\"&B2&\"'!AA73\")+INDIRECT(\"'\"&B2&\"'!AA74\")+INDIRECT(\"'\"&B2&\"'!AA75\")","v":{"$error":"#VALUE!"}}]
["P3 € HTR",{"$f":"INDIRECT(\"'\"&B2&\"'!AA77\")","v":0}]
["P4 € HTR",{"$f":"INDIRECT(\"'\"&B2&\"'!AA79\")","v":0}]
["P1 : coût de la fourniture du ou des combustibles"]
["P’1 : coût de l’électricité utilisée mécaniquement pour assurer le fonctionnement des installations primaires"]
["P2 : coût des prestations de conduite, de l’entretien, montant des redevances et frais divers"]
["P3 : coût gros entretien, renouvellement"]
["Recettes (€ HTR)\nDans les cas d'extension, l'ADEME attend des commentaires succincts sur la façon dont la répartition a été faite entre les valeurs relatives au réseau existant et celles, demandées ici, relatives à l'extension exclusivement"]
["Chiffre d'affaires annuel (hors Droits de raccordement) € HTR",{"$f":"INDIRECT(\"'\"&B2&\"'!Z103\")*1.15","v":0},"marge de 15%"]
["Droits de raccordement (valeur actualisée nette en année 1)",0]
[]
["Les colonnes ci-dessous estiment le déficit de financement, lequel sera vérifié systématiquement hormis dans les cas où le porteur de projet demande une aide inférieure aux taux d'aide autorisés par les points 7 et 8 de l'article 46 du RGEC (*)\n(*)\n7. L’intensité d’aide n’excède pas 30 % des coûts admissibles. L’intensité d’aide peut toutefois être majorée de 20 points de pourcentage pour les aides octroyées aux petites entreprises et de 10 points de pourcentage pour celles octroyées aux moyennes entreprises. \n8. L’intensité d’aide peut être majorée de 15 points de pourcentage pour les investissements utilisant uniquement des sources d’énergie renouvelables, de la chaleur résiduelle ou une combinaison des deux, y compris la cogénération renouvelable.\n"]
[]
["Années",{"$f":"INDIRECT(\"'\"&B2&\"'!Q8\")","v":"Année de démarrage du projet ?"},{"$f":"B29+1","v":{"$error":"#VALUE!"}},{"$f":"C29+1","v":{"$error":"#VALUE!"}},{"$error":"#VALUE!"},{"$error":"#VALUE!"},{"$error":"#VALUE!"},{"$error":"#VALUE!"},{"$error":"#VALUE!"},{"$error":"#VALUE!"},{"$error":"#VALUE!"},{"$error":"#VALUE!"},{"$error":"#VALUE!"},{"$error":"#VALUE!"},{"$error":"#VALUE!"},{"$error":"#VALUE!"},{"$error":"#VALUE!"},{"$error":"#VALUE!"},{"$error":"#VALUE!"},{"$error":"#VALUE!"},{"$error":"#VALUE!"}]
["Excédent Brut d'Exploitation (EBE) en €",{"$f":"B24+B25-SUM(B14:B17)","v":{"$error":"#VALUE!"}},{"$f":"$B$24-SUM($B$14:$B$17)","v":{"$error":"#VALUE!"}},{"$error":"#VALUE!"},{"$error":"#VALUE!"},{"$error":"#VALUE!"},{"$error":"#VALUE!"},{"$error":"#VALUE!"},{"$error":"#VALUE!"},{"$error":"#VALUE!"},{"$error":"#VALUE!"},{"$error":"#VALUE!"},{"$error":"#VALUE!"},{"$error":"#VALUE!"},{"$error":"#VALUE!"},{"$error":"#VALUE!"},{"$error":"#VALUE!"},{"$error":"#VALUE!"},{"$error":"#VALUE!"},{"$error":"#VALUE!"},{"$error":"#VALUE!"}]
[null,null,null,null,null,null,null,null,null,null,null,null,null,null,null,null,null,null,null,null,null,"Sommes"]
["Flux des investissements du projet à aider (-)",{"$f":"-A8","v":0},null,null,null,null,null,null,null,null,null,null,null,null,null,null,null,null,null,null,null,{"$f":"SUM(B32:U32)","v":0}]
[]
["Amortissement des investissements du projet à aider (-)",{"$f":"-$A$8/20","v":0},{"$f":"-$A$8/20","v":0},0,0,0,0,0,0,0,0,0,0,0,0,0,0,0,0,0,0,{"$f":"SUM(B34:U34)","v":0}]
[]
["Amortissement des subventions prévisionnelles totales (Fonds Chaleur et autres dispositifs, hors CEE) du projet à aider, sur 20 ans (+)",{"$f":"$A$11/20","v":0},{"$f":"$A$11/20","v":0},0,0,0,0,0,0,0,0,0,0,0,0,0,0,0,0,0,0,{"$f":"SUM(B36:U36)","v":0}]
[]
["Résultat imposable (méthode FC)",{"$f":"B30+B34+B36","v":{"$error":"#VALUE!"}},{"$error":"#VALUE!"},{"$error":"#VALUE!"},{"$error":"#VALUE!"},{"$error":"#VALUE!"},{"$error":"#VALUE!"},{"$error":"#VALUE!"},{"$error":"#VALUE!"},{"$error":"#VALUE!"},{"$error":"#VALUE!"},{"$error":"#VALUE!"},{"$error":"#VALUE!"},{"$error":"#VALUE!"},{"$error":"#VALUE!"},{"$error":"#VALUE!"},{"$error":"#VALUE!"},{"$error":"#VALUE!"},{"$error":"#VALUE!"},{"$error":"#VALUE!"},{"$error":"#VALUE!"},{"$f":"SUM(B38:U38)","v":{"$error":"#VALUE!"}}]
[]
["IS prévisionnel  (méthode FC) (-)",{"$f":"-IF(B38>0,B38*0.25,0)","v":{"$error":"#VALUE!"}},{"$f":"-IF(C38>0,C38*0.25,0)","v":{"$error":"#VALUE!"}},{"$error":"#VALUE!"},{"$error":"#VALUE!"},{"$error":"#VALUE!"},{"$error":"#VALUE!"},{"$error":"#VALUE!"},{"$error":"#VALUE!"},{"$error":"#VALUE!"},{"$error":"#VALUE!"},{"$error":"#VALUE!"},{"$error":"#VALUE!"},{"$error":"#VALUE!"},{"$error":"#VALUE!"},{"$error":"#VALUE!"},{"$error":"#VALUE!"},{"$error":"#VALUE!"},{"$error":"#VALUE!"},{"$error":"#VALUE!"},{"$error":"#VALUE!"},{"$f":"SUM(B40:U40)","v":{"$error":"#VALUE!"}}]
[]
["Flux des subventions prévisionnelles totales (Fonds Chaleur et autres dispositifs, hors CEE) du projet à aider (+)",{"$f":"A11","v":0},null,null,null,null,null,null,null,null,null,null,null,null,null,null,null,null,null,null,null,{"$f":"SUM(B42:U42)","v":0}]
[]
["Cash flow après IS prévisionnel sans aide  (méthode FC)",{"$f":"B30+B32+B40","v":{"$error":"#VALUE!"}},{"$error":"#VALUE!"},{"$error":"#VALUE!"},{"$error":"#VALUE!"},{"$error":"#VALUE!"},{"$error":"#VALUE!"},{"$error":"#VALUE!"},{"$error":"#VALUE!"},{"$error":"#VALUE!"},{"$error":"#VALUE!"},{"$error":"#VALUE!"},{"$error":"#VALUE!"},{"$error":"#VALUE!"},{"$error":"#VALUE!"},{"$error":"#VALUE!"},{"$error":"#VALUE!"},{"$error":"#VALUE!"},{"$error":"#VALUE!"},{"$error":"#VALUE!"},{"$error":"#VALUE!"},{"$f":"SUM(B44:U44)","v":{"$error":"#VALUE!"}}]
["Cash flow après IS prévisionnel avec aide (méthode FC)",{"$f":"B44+B42","v":{"$error":"#VALUE!"}},{"$f":"C44+C42","v":{"$error":"#VALUE!"}},{"$f":"D44+D42","v":{"$error":"#VALUE!"}},{"$f":"E44+E42","v":{"$error":"#VALUE!"}},{"$error":"#VALUE!"},{"$error":"#VALUE!"},{"$error":"#VALUE!"},{"$error":"#VALUE!"},{"$error":"#VALUE!"},{"$error":"#VALUE!"},{"$error":"#VALUE!"},{"$error":"#VALUE!"},{"$error":"#VALUE!"},{"$error":"#VALUE!"},{"$error":"#VALUE!"},{"$error":"#VALUE!"},{"$error":"#VALUE!"},{"$error":"#VALUE!"},{"$error":"#VALUE!"},{"$error":"#VALUE!"},{"$f":"SUM(B45:U45)","v":{"$error":"#VALUE!"}}]
[]
["Déficit de financement (année 2024) <=> aide maximale autorisée\n(la valeur ci-dessous doit être positive)"]
[{"$f":"-NPV(0.0747,B44:U44)","v":{"$error":"#VALUE!"}},"taux de 7,47% sur 20 ans"]
["TRI prévisionnel du projet après aide"]
[{"$f":"IRR(B45:U45)","v":{"$error":"#VALUE!"}}]
[]
[]
["marge d'exploitation = somme (recette exploitation sur 20ans- cout d'explotation sur 20ans)",{"$f":"B24*20-SUM(B14:B18)*20","v":{"$error":"#VALUE!"}}]
[]
["aide maximale = cout du réseau- marge d'exploitation",{"$f":"INDIRECT(\"'\"&B2&\"'!$R$85\")-'Déficit de financement'!B53","v":{"$error":"#VALUE!"}}]